5-Methyl-(E)-2-hepten-4-one

Normal alkane RI, polar column, custom temperature program

Data compiled by: NIST Mass Spectrometry Data Center, William E. Wallace, director

Column type CapillaryCapillary
Active phase FFAPFFAP
Column length (m) 30.30.
Carrier gas HeHe
Substrate
Column diameter (mm) 0.320.32
Phase thickness (μm) 0.250.25
Program 35C(1min) => 40C/min => 60C (1min) => 6C/min => 230C35C (2min) => 40C/min => 60C (2min) => 6C/min => 180C => 10C/min => 240C
I 1265.1287.
ReferenceMatsui, Guth, et al., 1998Schermann and Schieberle, 1997
Comment MSDC-RI MSDC-RI

References

Matsui, Guth, et al., 1998
Matsui, T.; Guth, H.; Grosch, W., A comparative study of potent odorants in peanut, hazelnut, and pumpkin seed oils on the basis of aroma extract dilution analysis (AEDA) and gas chromatography-olfactometry of headspace samples (GCOH), Lipid - Fett, 1998, 100, 2, 51-56, https://doi.org/10.1002/(SICI)1521-4133(199802)100:2<51::AID-LIPI51>3.0.CO;2-W . [all data]

Schermann and Schieberle, 1997
Schermann, P.; Schieberle, P., Evaluation of key odorants in milk chocolate and cocoa mass by aroma extract dilution analyses, J. Agric. Food Chem., 1997, 45, 3, 867-872, https://doi.org/10.1021/jf960670h . [all data]