Resorcinol monoacetate
- Formula: C8H8O3
- Molecular weight: 152.1473
- IUPAC Standard InChIKey: ZZPKZRHERLGEKA-UHFFFAOYSA-N
- CAS Registry Number: 102-29-4
- Chemical structure:

Van Den Dool and Kratz RI, non-polar column, custom temperature program

Column type | Active phase | I | Reference | Comment |
---|---|---|---|---|
Capillary | VF-5MS | 1382.6 | Tret'yakov, 2008 | 30. m/0.25 mm/0.25 μm, He; Program: Multi-step temperature program; T(initial)=60C; T(final)=270C |

Phase change data

Data compiled by: Robert L. Brown and Stephen E. Stein
Quantity | Value | Units | Method | Reference | Comment |
---|---|---|---|---|---|
Tboil | 556.2 | K | N/A | Aldrich Chemical Company Inc., 1990 | |
Tboil | 556. | K | N/A | Buckingham and Donaghy, 1982 |

References

Tret'yakov, 2008
Tret'yakov, K.V.,
Retention Data. NIST Mass Spectrometry Data Center., NIST Mass Spectrometry Data Center, 2008. [all data]