DDMU

Phase change data

Data compiled by: William E. Acree, Jr., James S. Chickos

Enthalpy of fusion

ΔfusH (kJ/mol) Temperature (K) Method Reference
25.52337.9DSCPlato and Glasgow, 1969

References

Plato and Glasgow, 1969
Plato, Candace.; Glasgow, Augustus R., Differential scanning calorimetry as a general method for determining the purity and heat of fusion of high-purity organic chemicals. Application to 95 compounds, Anal. Chem., 1969, 41, 2, 330-336, https://doi.org/10.1021/ac60271a041 . [all data]