α-Muurolene

Kovats' RI, polar column, temperature ramp

Data compiled by: NIST Mass Spectrometry Data Center, William E. Wallace, director

Column type CapillaryCapillaryCapillaryCapillaryCapillary
Active phase Supelcowax-10DB-WaxInnowaxSupelcowax-10DB-Wax
Column length (m) 30.30.30.30.60.
Carrier gas  HeHe He
Substrate
Column diameter (mm) 0.250.320.25 0.25
Phase thickness (μm) 0.250.250.25
Tstart (C) 40.40.40.40.40.
Tend (C) 210.220.190.210.200.
Heat rate (K/min) 2.3.5.2.2.
Initial hold (min) 2.5. 2.2.
Final hold (min) 33. 5.120.
I 1729.1707.1750.1714.1720.
ReferenceSylvestre, Pichette, et al., 2006Lopes, Strobl, et al., 2004Mahmood, Kaul, et al., 2004Loayza, Abujder, et al., 1995Umano, Hagi, et al., 1994
Comment MSDC-RI MSDC-RI MSDC-RI MSDC-RI MSDC-RI
Column type CapillaryCapillaryCapillaryCapillaryCapillary
Active phase Carbowax 20MCarbowax 20MCarbowax 20MCarbowax 20MCarbowax 20M
Column length (m) 50.100.100.70.50.
Carrier gas H2  N2He
Substrate
Column diameter (mm) 0.30.280.280.280.28
Phase thickness (μm) 0.15
Tstart (C) 70.80.80.80.70.
Tend (C) 210.200.200.200.190.
Heat rate (K/min) 2.3.3.2.2.
Initial hold (min)
Final hold (min)
I 1685.1684.1685.1717.1715.
ReferenceGaydou, Randriamiharisoa, et al., 1986Bernhard, Shibamoto, et al., 1983Bernhard, Shibamoto, et al., 1983Yamaguchi and Shibamoto, 1981Tressl, Friese, et al., 1978
Comment MSDC-RI MSDC-RI MSDC-RI MSDC-RI MSDC-RI

Normal alkane RI, polar column, temperature ramp

Data compiled by: NIST Mass Spectrometry Data Center, William E. Wallace, director

Column type CapillaryCapillaryCapillaryCapillaryCapillary
Active phase RTX-WaxDB-WaxDB-WaxDB-WaxRTX-Wax
Column length (m) 60.30.15.30.60.
Carrier gas HeliumHeliumHeliumHydrogenHelium
Substrate
Column diameter (mm) 0.220.250.250.250.22
Phase thickness (μm) 0.250.250.250.250.25
Tstart (C) 60.40.40.30.60.
Tend (C) 230.230.260.230.230.
Heat rate (K/min) 2.4.4.8.2.
Initial hold (min)  2. 5.
Final hold (min) 5.4.55.10.30.
I 1710.1716.1725.1725.1699.
ReferenceBendiabdellah, El Amine Dib, et al., 2012Zeng, Xie, et al., 2011Miyazawa, Kawauchi, et al., 2010Karlsson, Birgersson, et al., 2009Museli, Pau, et al., 2009
Comment MSDC-RI MSDC-RI MSDC-RI MSDC-RI MSDC-RI
Column type CapillaryCapillaryCapillaryCapillaryCapillary
Active phase DB-WaxRTX-WaxCarbowaxHP-InnowaxCP-Wax 52CB
Column length (m) 60.60.60.30.30.
Carrier gas HeliumHeHeHeHe
Substrate
Column diameter (mm) 0.250.220.20.250.32
Phase thickness (μm) 0.250.250.250.250.25
Tstart (C) 50.60.60.60.40.
Tend (C) 220.230.250.240.220.
Heat rate (K/min) 3.2.2.2.3.
Initial hold (min) 2. 8. 1.
Final hold (min) 70.35.15.20.2.
I 1730.1716.1706.1714.1740.
ReferenceShimizu, Imayoshi, et al., 2009Paolini, Tomi, et al., 2008Ferhat, Meklati, et al., 2007Hachicha, Skanji, et al., 2007Hymete, Rohloff, et al., 2007
Comment MSDC-RI MSDC-RI MSDC-RI MSDC-RI MSDC-RI
Column type CapillaryCapillaryCapillaryCapillaryCapillary
Active phase TC-FFAPTC-FFAPTC-WaxSupelcowax-10Supelcowax-10
Column length (m)   60.30.30.
Carrier gas HeHeHeHe
Substrate
Column diameter (mm) 0.250.250.250.20.25
Phase thickness (μm) 0.250.250.250.20.25
Tstart (C) 60.60.60.70.40.
Tend (C) 220.220.240.220.210.
Heat rate (K/min) 3.3.2.3.2.
Initial hold (min)
Final hold (min) 30.30. 15.33.
I 1724.1723.1721.1718.1728.
ReferenceKurose, Okamura, et al., 2007Kurose, Okamura, et al., 2007Miyazawa and Tamura, 2007Pinto, Salgueiro, et al., 2007Sylvestre, Longtin, et al., 2007
Comment MSDC-RI MSDC-RI MSDC-RI MSDC-RI MSDC-RI
Column type CapillaryCapillaryCapillaryCapillaryCapillary
Active phase Supelcowax-10BP-20Supelcowax 10HP-20MSupelcowax-10
Column length (m) 30.50.30.50.30.
Carrier gas He HeliumHe
Substrate
Column diameter (mm) 0.250.220.200.20.25
Phase thickness (μm) 0.250.250.200.10.25
Tstart (C) 40.60.70.60.40.
Tend (C) 250.220.220.220.210.
Heat rate (K/min) 3.2.3.2.2.
Initial hold (min) 5.   2.
Final hold (min) 10.20.15.30.33.
I 1748.1687.1718.1749.1727.
ReferenceVichi, Riu-Aumatell, et al., 2007Boti, Yao, et al., 2006Cavaleiro, Pinto, et al., 2006Filippi, Lanfranchi, et al., 2006Garneau F.X., Collin G., et al., 2006
Comment MSDC-RI MSDC-RI MSDC-RI MSDC-RI MSDC-RI
Column type CapillaryCapillaryCapillaryCapillaryCapillary
Active phase DB-WaxBP-20HP-WaxHP-20MDB-Innowax
Column length (m) 30.50.30.30.60.
Carrier gas HeHeNitrogenN2Helium
Substrate
Column diameter (mm) 0.250.220.250.250.25
Phase thickness (μm) 0.250.250.250.250.25
Tstart (C) 50.60.50.50.60.
Tend (C) 250.220.280.250.240.
Heat rate (K/min) 3.2.5.5.3.
Initial hold (min)
Final hold (min) 10.20.5.10.20.
I 1724.1723.1738.1738.1730.
ReferenceHavlik, Kokoska, et al., 2006Lesueur, Ban, et al., 2006Marzouk, Mansour, et al., 2006Marzouk, Neffati, et al., 2006Mendivil, Rodrigues, et al., 2006
Comment MSDC-RI MSDC-RI MSDC-RI MSDC-RI MSDC-RI
Column type CapillaryCapillaryCapillaryCapillaryCapillary
Active phase NB-20MHP-InnowaxSupelcowaxInnowaxCP-Wax
Column length (m) 30.30.60.60.30.
Carrier gas HeHeHeHeHe
Substrate
Column diameter (mm) 0.20.250.20.250.32
Phase thickness (μm) 0.250.170.20.250.25
Tstart (C) 50.60.60.60.40.
Tend (C) 250.210.230.240.180.
Heat rate (K/min) 2.4.4.5.5.
Initial hold (min)  3.30. 2.
Final hold (min)  15. 30.
I 1720.1753.1703.1750.1706.
ReferenceOrav, Raal, et al., 2006Ferretti, Maggi, et al., 2005Gauvin and Smadja, 2005Joichi, Yomogida, et al., 2005Ka, Choi, et al., 2005
Comment MSDC-RI MSDC-RI MSDC-RI MSDC-RI MSDC-RI
Column type CapillaryCapillaryCapillaryCapillaryCapillary
Active phase HP-20MHP-20MSupelcowax-10BP-20DB-Wax
Column length (m) 50.50.30.50.60.
Carrier gas HeliumHelium  N2
Substrate
Column diameter (mm) 0.200.200.250.220.25
Phase thickness (μm) 0.200.200.250.250.25
Tstart (C) 70.70.40.60.70.
Tend (C) 180.180.220.220.230.
Heat rate (K/min) 4.4.3.2.2.
Initial hold (min) 4.4.5. 2.
Final hold (min) 10.10.10.20.20.
I 1735.1735.1748.1712.1680.
ReferenceKulisic, Radonic, et al., 2005Kulisic, Radonic, et al., 2005Vichi, Riu-Aumatell, et al., 2005Blanc, Muselli, et al., 2004Choi, 2004
Comment MSDC-RI MSDC-RI MSDC-RI MSDC-RI MSDC-RI
Column type CapillaryCapillaryCapillaryCapillaryCapillary
Active phase Supelcowax-10Carbowax 20MInnowax FSCSW-10TC-Wax
Column length (m) 30.30.60.50.60.
Carrier gas N2HeHeliumHeHe
Substrate
Column diameter (mm) 0.250.250.250.200.25
Phase thickness (μm) 0.250.25 0.25
Tstart (C) 40.60.60.50.80.
Tend (C) 230.250.220.230.240.
Heat rate (K/min) 2.3.4.2.3.
Initial hold (min)   10.
Final hold (min)
I 1695.1738.1740.1712.1682.
ReferenceGonzález, Guerra, et al., 2004Lago, de Ávila, et al., 2004Lourens, Reddy, et al., 2004Raal, Paaver, et al., 2004Miyazawa, Teranishi, et al., 2003
Comment MSDC-RI MSDC-RI MSDC-RI MSDC-RI MSDC-RI
Column type CapillaryCapillaryCapillaryCapillaryCapillary
Active phase Supelcowax-10Supelcowax-10DB-WaxDB-WaxCP-Wax 52CB
Column length (m) 30.30.60.60.50.
Carrier gas He N2HeHe
Substrate
Column diameter (mm) 0.250.250.250.250.30
Phase thickness (μm) 0.250.250.250.250.25
Tstart (C) 40.40.70.45.40.
Tend (C) 200.210.230.240.220.
Heat rate (K/min) 3.2.2.3.3.
Initial hold (min) 10.2.2. 5.
Final hold (min)  33.20.
I 1718.1700.1724.1716.1730.
ReferenceVichi, Pizzale, et al., 2003Kabouss, Charrouf, et al., 2002Tu, Onishi, et al., 2002Christoph, 2001Chagonda, Makanda, et al., 2000
Comment MSDC-RI MSDC-RI MSDC-RI MSDC-RI MSDC-RI
Column type CapillaryCapillaryCapillaryCapillaryCapillary
Active phase HP-20MDB-WaxDB-WaxHP Innowax FSPInnowax
Column length (m) 50.60.60.60.60.
Carrier gas HeHeliumHeHeHe
Substrate
Column diameter (mm) 0.200.320.250.250.25
Phase thickness (μm) 0.200.250.250.250.25
Tstart (C) 70.50.40.60.60.
Tend (C) 180.230.200.220.220.
Heat rate (K/min) 4.5.2.
Initial hold (min) 4.2.2.10.10.
Final hold (min)    10.
I 1693.1721.1722.1740.1737.
ReferenceMastelic, Milos, et al., 2000Paniandy, Chane-Ming, et al., 2000Umano, Hagi, et al., 2000Kaya, Baser, et al., 1999Kaya, Baser, et al., 1999, 2
Comment MSDC-RI MSDC-RI MSDC-RI MSDC-RI MSDC-RI
Column type CapillaryCapillaryCapillaryCapillaryCapillary
Active phase HP-InnowaxHP-InnowaxCarbowaxDB-WaxNB-351
Column length (m) 60.60.50.60.25.
Carrier gas HeHeN2HeH2
Substrate
Column diameter (mm) 0.250.250.20.250.3
Phase thickness (μm) 0.250.25 0.250.5
Tstart (C) 60.60.80.60.70.
Tend (C) 220.220.200.240.250.
Heat rate (K/min)   1.4.5.
Initial hold (min) 10.10.  2.
Final hold (min)   20.
I 1740.1740.1730.1733.1722.
ReferenceKaya, Baser, et al., 1999, 3Kaya, Baser, et al., 1999, 3Menon, Chacko, et al., 1999Ngassoum, Yonkeu, et al., 1999Onocha, Ekundayo, et al., 1999
Comment MSDC-RI MSDC-RI MSDC-RI MSDC-RI MSDC-RI
Column type CapillaryCapillaryCapillaryCapillaryCapillary
Active phase BP-20DB-WaxHP-InnowaxHP-Innowax FSCBP-20
Column length (m) 25.30.60.60.25.
Carrier gas H2N2HeHeH2
Substrate
Column diameter (mm) 0.330.250.250.250.33
Phase thickness (μm) 0.50.250.250.250.5
Tstart (C) 80.45.50.60.80.
Tend (C) 220.220.220.220.220.
Heat rate (K/min) 5.3.5.4.5.
Initial hold (min)   5.10.
Final hold (min)    10.
I 1742.1755.1769.1737.1742.
ReferenceBignell, Dunlop, et al., 1998Molleken U., Sinnwell V., et al., 1998Stashenko, Cervantes, et al., 1998Tümen, Baser, et al., 1998Bignell, Dunlop, et al., 1997
Comment MSDC-RI MSDC-RI MSDC-RI MSDC-RI MSDC-RI
Column type CapillaryCapillaryCapillaryCapillaryCapillary
Active phase BP-20BP-20BP-20BP-20BP-20
Column length (m) 25.25.25.25.25.
Carrier gas H2H2H2 H2
Substrate
Column diameter (mm) 0.330.330.330.330.33
Phase thickness (μm) 0.50.50.50.50.5
Tstart (C) 80.80.80.80.80.
Tend (C) 220.220.220.220.220.
Heat rate (K/min) 5.5.5.5.5.
Initial hold (min)
Final hold (min)
I 1742.1742.1742.1742.1742.
ReferenceBignell, Dunlop, et al., 1997, 2Bignell, Dunlop, et al., 1997, 3Bignell, Dunlop, et al., 1997, 4Bignell, Dunlop, et al., 1997, 5Bignell, Dunlop, et al., 1997, 6
Comment MSDC-RI MSDC-RI MSDC-RI MSDC-RI MSDC-RI
Column type CapillaryCapillaryCapillaryCapillaryCapillary
Active phase Supelcowax-10PEG-20MCarbowax 20MDB-WaxDB-Wax
Column length (m) 0.50.60.60.60.
Carrier gas HeHeHe
Substrate
Column diameter (mm) 0.250.250.250.320.32
Phase thickness (μm)   0.250.5
Tstart (C) 40.70.50.50.50.
Tend (C) 240.250.150.225.230.
Heat rate (K/min) 3.2.2.2.4.
Initial hold (min)   10.
Final hold (min)   20. 10.
I 1695.1719.1730.1746.1719.
ReferenceZygadlo, Ariza-Espinar, et al., 1997Orav, Kailas, et al., 1996Tirado, Stashenko, et al., 1995Sagrero-Nieves, Bartley, et al., 1994Binder, Benson, et al., 1990
Comment MSDC-RI MSDC-RI MSDC-RI MSDC-RI MSDC-RI
Column type CapillaryCapillaryCapillaryCapillaryCapillary
Active phase DB-WaxDB-WaxDB-WaxFFAPDB-Wax
Column length (m) 60.60.30.50.60.
Carrier gas     He
Substrate
Column diameter (mm) 0.320.320.32 0.32
Phase thickness (μm)     0.25
Tstart (C) 50.50.70.50.30.
Tend (C) 230.230.200.180.180.
Heat rate (K/min) 4.4.4.10.2.
Initial hold (min)   2.1.4.
Final hold (min) 10.10.
I 1685.1720.1729.1743.1700.
ReferenceBinder, Turner, et al., 1990Binder, Turner, et al., 1990Wyllie, Brophy, et al., 1990Brophy, Davies, et al., 1989Takeoka and Butter, 1989
Comment MSDC-RI MSDC-RI MSDC-RI MSDC-RI MSDC-RI
Column type CapillaryCapillaryCapillaryCapillaryCapillary
Active phase DB-WaxSupelcowax-10Carbowax 20MSupelcowax-10Carbowax 20M
Column length (m) 60.30.25.30.150.
Carrier gas He  He
Substrate
Column diameter (mm) 0.32 0.30 0.66
Phase thickness (μm) 0.25
Tstart (C) 30.50.40.50.60.
Tend (C) 180.240.220.240.170.
Heat rate (K/min) 2.4.2.4.1.
Initial hold (min) 4.2.5.2.40.
Final hold (min)  10. 10.
I 1700.1727.1717.1727.1700.
ReferenceTakeoka and Butter, 1989Ramaswami, Briscese, et al., 1988Nykanen, 1986Ramaswami, Briscese, et al., 1986Buttery, Xu, et al., 1985
Comment MSDC-RI MSDC-RI MSDC-RI MSDC-RI MSDC-RI
Column type CapillaryCapillaryCapillaryCapillary
Active phase Carbowax 20MCarbowax 20MCarbowax 20MCarbowax 20M
Column length (m) 150.50.100.100.
Carrier gas
Substrate
Column diameter (mm) 0.660.320.250.25
Phase thickness (μm)
Tstart (C) 60.70.70.70.
Tend (C) 170.180.170.170.
Heat rate (K/min) 1.2.1.1.
Initial hold (min) 40.
Final hold (min)
I 1700.1677.1729.1730.
ReferenceButtery and Ling, 1984Tressl, Engel, et al., 1983Shibamoto and Jennings, 1977Shibamoto and Jennings, 1977
Comment MSDC-RI MSDC-RI MSDC-RI MSDC-RI

Van Den Dool and Kratz RI, polar column, temperature ramp

Data compiled by: NIST Mass Spectrometry Data Center, William E. Wallace, director

Column type CapillaryCapillaryCapillaryCapillaryCapillary
Active phase HP-InnowaxRTX-WaxRTX-WaxRTX-WaxHP-Innowax
Column length (m) 30.60.60.60.60.
Carrier gas HeHeHeHeHe
Substrate
Column diameter (mm) 0.250.220.220.220.25
Phase thickness (μm) 0.250.250.250.250.25
Tstart (C) 60.60.60.60.50.
Tend (C) 280.230.230.230.220.
Heat rate (K/min) 3.2.2.2.4.
Initial hold (min)     4.
Final hold (min)  30.35.35.10.
I 1734.1701.1716.1716.1731.
ReferenceKundakovic, Fokialakis, et al., 2007Muselli, Rossi, et al., 2007Paolini J., Costa J., et al., 2007Paolini, Muselli, et al., 2007Quijano, Linares, et al., 2007
Comment MSDC-RI MSDC-RI MSDC-RI MSDC-RI MSDC-RI
Column type CapillaryCapillaryCapillaryCapillaryCapillary
Active phase HP-InnowaxDB-WaxBP-20BP-20Polyethylene Glycol
Column length (m) 30.30.50.50.30.
Carrier gas HeHe HeN2
Substrate
Column diameter (mm) 0.250.250.220.220.32
Phase thickness (μm) 0.50.250.250.250.25
Tstart (C) 60.40.60.60.50.
Tend (C) 260.250.220.220.230.
Heat rate (K/min) 3.3.2.2.2.
Initial hold (min)  5.  10.
Final hold (min)  10.20.20.15.
I 1724.1727.1724.1717.1729.
ReferenceSaroglou, Marin, et al., 2007Aromdee and Sriubolmas, 2006Blanc, Bradesi, et al., 2006Boti, Bighelli, et al., 2006Dob, Dahmane, et al., 2006
Comment MSDC-RI MSDC-RI MSDC-RI MSDC-RI MSDC-RI
Column type CapillaryCapillaryCapillaryCapillaryCapillary
Active phase BP-20HP-WaxBP-20HP-20MRTX-Wax
Column length (m) 50.30.50.50.60.
Carrier gas HeN2HeHeHe
Substrate
Column diameter (mm) 0.220.250.220.20.22
Phase thickness (μm) 0.250.250.250.20.25
Tstart (C) 60.60.60.70.60.
Tend (C) 220.220.220.180.230.
Heat rate (K/min) 2.5.2.4.2.
Initial hold (min)  10. 4.
Final hold (min) 20. 20.10.35.
I 1719.1711.1719.1735.1716.
ReferenceDuquesnoy, Dinh, et al., 2006Flamini, Tebano, et al., 2006Gonny, Cavaleiro, et al., 2006Skocibusic, Bezic, et al., 2006Paolini, Costa, et al., 2005
Comment MSDC-RI MSDC-RI MSDC-RI MSDC-RI MSDC-RI
Column type CapillaryCapillaryCapillaryCapillaryCapillary
Active phase Supelcowax-10DB-WaxSupelcowax-10HP-WaxHP-Wax
Column length (m) 30.30.30.30.30.
Carrier gas HeN2HeHeN2
Substrate
Column diameter (mm) 0.250.250.20.250.25
Phase thickness (μm) 0.250.250.20.250.25
Tstart (C) 60.60.70.60.60.
Tend (C) 240.220.220.240.220.
Heat rate (K/min) 3.5.3.3.5.
Initial hold (min) 5.10.  10.
Final hold (min) 10. 15.
I 1711.1727.1719.1720.1733.
ReferenceRiu-Aumatell, Lopez-Tamames, et al., 2005Bertoli, Menichini, et al., 2004Cavaleiro, Salgueiro, et al., 2004Flamini, Bader, et al., 2004Flamini, Luigi Cioni, et al., 2004
Comment MSDC-RI MSDC-RI MSDC-RI MSDC-RI MSDC-RI
Column type CapillaryCapillaryCapillaryCapillaryCapillary
Active phase HP-InnowaxDB-WaxCarbowax 20MRTX-WaxDB-Wax
Column length (m) 30.30.25.60.60.
Carrier gas HeHeHeHeH2
Substrate
Column diameter (mm) 0.250.250.250.220.32
Phase thickness (μm) 0.50.250.30.250.25
Tstart (C) 60.40.50.60.40.
Tend (C) 260.200.200.230.245.
Heat rate (K/min) 3.4.3.2.1.5
Initial hold (min)  5.1.
Final hold (min)  20.20.45.20.
I 1735.1697.1725.1715.1729.
ReferenceGrujic-Jovanovic, Skaltsa, et al., 2004Yu, Kim, et al., 2004Bicchi, Rubiolo, et al., 2003Cavalli, Tomi, et al., 2003Gancel, Ollitrault, et al., 2003
Comment MSDC-RI MSDC-RI MSDC-RI MSDC-RI MSDC-RI
Column type CapillaryCapillaryCapillaryCapillaryCapillary
Active phase HP-20MHP-20MHP-InnowaxInnowaxAT-Wax
Column length (m) 50.50.30.30.60.
Carrier gas HeHeHeHeHe
Substrate
Column diameter (mm) 0.20.20.250.250.32
Phase thickness (μm) 0.20.20.50.50.25
Tstart (C) 70.70.60.60.65.
Tend (C) 180.180.260.260.250.
Heat rate (K/min) 4.5.3.3.2.
Initial hold (min) 4.4.  10.
Final hold (min) 10.10. 10.60.
I 1760.1735.1724.1725.1704.
ReferenceJerkovic, Mastelic, et al., 2003Radonic and Milso, 2003Skaltsa, Demetzos, et al., 2003Couladis, Chinou, et al., 2002Pino, Marbot, et al., 2002
Comment MSDC-RI MSDC-RI MSDC-RI MSDC-RI MSDC-RI
Column type CapillaryCapillaryCapillaryCapillaryCapillary
Active phase AT-WaxDB-WaxDB-WaxDB-WaxHP-20M
Column length (m) 60.60.60.60.50.
Carrier gas HeHeHeHe
Substrate
Column diameter (mm) 0.320.500.530.530.2
Phase thickness (μm) 0.251.01.01.00.2
Tstart (C) 65.60.50.50.70.
Tend (C) 250.225.220.220.180.
Heat rate (K/min) 2.3.3.3.4.
Initial hold (min) 10.   4.
Final hold (min) 60.   10.
I 1704.1690.1690.1690.1693.
ReferencePino, Marbot, et al., 2001Brophy, Goldsack, et al., 2000Brophy, Goldsack, et al., 2000, 2Brophy, Goldsack, et al., 2000, 3Milos and Radonic, 2000
Comment MSDC-RI MSDC-RI MSDC-RI MSDC-RI MSDC-RI
Column type CapillaryCapillaryCapillaryCapillaryCapillary
Active phase DB-WaxDB-WaxInnowaxCarbowax 20MSP-1000
Column length (m) 60.60.60.25.85.
Carrier gas HeHeHeH2He
Substrate
Column diameter (mm) 0.530.530.250.250.5
Phase thickness (μm)   0.250.3
Tstart (C) 50.50.50.50.60.
Tend (C) 220.220.180.200.225.
Heat rate (K/min) 3.3.2.53.3.
Initial hold (min)   5.1.
Final hold (min)    20.
I 1729.1690.1769.1721.1690.
ReferenceBrophy, Goldsack, et al., 1999Brophy, Goldsack, et al., 1999, 2Stashenko, Cervantes, et al., 1999Bicchi, Rubiolo, et al., 1998Brophy, Forster, et al., 1998
Comment MSDC-RI MSDC-RI MSDC-RI MSDC-RI MSDC-RI
Column type CapillaryCapillaryCapillaryCapillaryCapillary
Active phase DB-WaxDB-WaxCarbowax 20MDB-WaxSP-1000
Column length (m) 60.60.25.60.85.
Carrier gas HeHe HeHe
Substrate
Column diameter (mm) 0.320.320.250.320.5
Phase thickness (μm)   0.3
Tstart (C) 65.35.50.65.65.
Tend (C) 225.220.200.225.225.
Heat rate (K/min) 3.3.3.3.3.
Initial hold (min)   1.
Final hold (min)   20.
I 1690.1690.1721.1690.1690.
ReferenceBrophy, Goldsack, et al., 1998Brophy, Goldsack, et al., 1998, 2Bicchi, Fresia, et al., 1997Brophy, Goldsack, et al., 1997Brophy, Goldsack, et al., 1997, 2
Comment MSDC-RI MSDC-RI MSDC-RI MSDC-RI MSDC-RI
Column type CapillaryCapillaryCapillary
Active phase DB-WaxCarbowax 20MHP-20M
Column length (m) 60.50.50.
Carrier gas HeHeHe
Substrate
Column diameter (mm) 0.250.20.25
Phase thickness (μm) 0.250.2
Tstart (C) 50.30.60.
Tend (C) 180.170.190.
Heat rate (K/min) 2.54.3.
Initial hold (min) 5.2.
Final hold (min)  20.
I 1769.1726.1714.
ReferenceStashenko, Prada, et al., 1996Píry, Príbela, et al., 1995Chung, Eiserich, et al., 1993
Comment MSDC-RI MSDC-RI MSDC-RI

Van Den Dool and Kratz RI, non-polar column, custom temperature program

Data compiled by: NIST Mass Spectrometry Data Center, William E. Wallace, director

Column type CapillaryCapillaryCapillaryCapillaryCapillary
Active phase HP-5MSDB-5BP-5CBP-5BPX-5
Column length (m) 30.30.25.30.30.
Carrier gas HeHeHeHe
Substrate
Column diameter (mm) 0.250.250.220.250.25
Phase thickness (μm) 0.250.250.250.250.25
Program 60C (1 min) => 5 C/min => 210C => 10 C/min => 280C (15 min)40C(2min) => 4C/min => 220C => 20C/min => 280C30C(1min) => 50C/min => 105C => 1.5C/min => 150C => 30C/min => 280C (10min)60C => 3C/min => 246C => 10C/min => 270C (5min)35C(5min) => 3C/min => 210C => 40C/min => 240C (4min)
I 1507.31503.1498.1500.1513.
ReferenceAndriamaharavo, 2014Andrade, Sampaio, et al., 2007Sant'Anna, Fontes, et al., 2007Silva, Oliveira, et al., 2007Cardeal, da Silva, et al., 2006
Comment MSDC-RI MSDC-RI MSDC-RI MSDC-RI MSDC-RI
Column type CapillaryCapillaryCapillaryCapillaryCapillary
Active phase DB-5DB-5DB-1SE-525 % Phenyl methyl siloxane
Column length (m) 30. 30.30.30.
Carrier gas He HeHeHe
Substrate
Column diameter (mm) 0.32 0.250.320.32
Phase thickness (μm) 0.25 0.250.150.15
Program 40C(3min) => 3C/min => 180C => 10C/min => 260C(2min)not specified35C => 2C/min => 200C => 5C/min => 240C45C => 1C/min => 100C => 5C/min => 250C(10min)45C => 1C/min => 100C => 5C/min => 250C (10min)
I 1494.1523.1474.1500.1500.
ReferenceMoon, Cliff, et al., 2006Özel, Gögüs, et al., 2006Suliman F.E.O., Fatope M.O., et al., 2006Bruni, Pellati, et al., 2005Sacchetti, Maietti, et al., 2005
Comment MSDC-RI MSDC-RI MSDC-RI MSDC-RI MSDC-RI
Column type CapillaryCapillaryCapillaryCapillaryCapillary
Active phase DB-5MSCP Sil 8 CBHP-5HP-5BP-1
Column length (m) 30.50.50.50.50.
Carrier gas HeHeHeHe
Substrate
Column diameter (mm) 0.250.320.20.20.22
Phase thickness (μm) 0.25 0.330.330.25
Program 40 (5min) => 4C/min => 140C => 4C/min => 200C (20min)60C (2min) => 5C/min => 160C (1min) => 10C/min => 250C (2min)50C(2min) => 5C/min => 150C => 10C/min => 250C(30min)50C(2min) => 5C/min => 150C => 10C/min => 250C(30min)not specified
I 1499.1499.1496.1498.1495.
ReferenceZheng, Kim, et al., 2005Mockute and Judzentiene, 2003García, Alvarez, et al., 2002García, Alvarez, et al., 2002Cavalli, Ranarivelo, et al., 2001
Comment MSDC-RI MSDC-RI MSDC-RI MSDC-RI MSDC-RI
Column type CapillaryCapillary
Active phase DB-1SE-52
Column length (m) 60.25.
Carrier gas HeHe
Substrate
Column diameter (mm) 0.250.25
Phase thickness (μm) 0.250.25
Program -20C (5min) => 10C/min => 100C => 4C/min => 200C => 10C/min => 280C60C(8min) => 3C/min => 180C => 20C/min => 230C
I 1527.1500.
ReferenceEri, Khoo, et al., 2000Lorenzo, Dellacassa, et al., 2000
Comment MSDC-RI MSDC-RI

Kovats' RI, polar column, isothermal

Data compiled by: NIST Mass Spectrometry Data Center, William E. Wallace, director

Column type PackedPackedPackedPacked
Active phase Carbowax 20MCarbowax 20MCarbowax 20MCarbowax 20M
Column length (m)
Carrier gas
Substrate
Column diameter (mm)
Phase thickness (μm)
Temperature (C) 165.132.132.165.
I 1753.1726.1726.1752.
ReferenceAndersen, Syrdal, et al., 1973Andersen and Falcone, 1969Andersen and Falcone, 1969Andersen and Falcone, 1969
Comment MSDC-RI MSDC-RI MSDC-RI MSDC-RI

References

Sylvestre, Pichette, et al., 2006
Sylvestre, M.; Pichette, A.; Longtin, A.; Nagau, F.; Legault, J., Essential oil analysis and anticancer activity of leaf essential oil of Croton flavens L. from Guadeloupe, J. Ethnopharmacol., 2006, 103, 1, 99-102, https://doi.org/10.1016/j.jep.2005.07.011 . [all data]

Lopes, Strobl, et al., 2004
Lopes, D.; Strobl, H.; Kolodziejczyk, P., 14-Methylpentadecano-15-lactone (Muscolide): a new macrocyclic lactone from the oil of Angelica archangelica L., Chemistry and Biodiversity, 2004, 1, 12, 1880-1887, https://doi.org/10.1002/cbdv.200490144 . [all data]

Mahmood, Kaul, et al., 2004
Mahmood, U.; Kaul, V.K.; Acharya, R., Volatile constituents of Capillipedium parviflorum, Phytochemistry, 2004, 65, 14, 2163-2166, https://doi.org/10.1016/j.phytochem.2004.04.003 . [all data]

Loayza, Abujder, et al., 1995
Loayza, I.; Abujder, D.; Aranda, R.; Jakupovic, J.; Collin, G.; Deslauriers, H.; Jean, F.-I., Essential oils of Baccharis salicifolia, B. latifolia and B. dracunculifolia, Phytochemistry, 1995, 38, 2, 381-389, https://doi.org/10.1016/0031-9422(94)00628-7 . [all data]

Umano, Hagi, et al., 1994
Umano, K.; Hagi, Y.; Tamura, T.; Shoji, A.; Shibamoto, T., Identification of volatile compounds isolated from round kumquat (Fortunella japonica Swingle), J. Agric. Food Chem., 1994, 42, 9, 1888-1890, https://doi.org/10.1021/jf00045a011 . [all data]

Gaydou, Randriamiharisoa, et al., 1986
Gaydou, E.M.; Randriamiharisoa, R.; Bianchini, J.-P., Composition of the essential oil of ylang-ylang (Canaga odorata Hook Fil. et Thomson forma genuina) from Madagascar, J. Agric. Food Chem., 1986, 34, 3, 481-487, https://doi.org/10.1021/jf00069a028 . [all data]

Bernhard, Shibamoto, et al., 1983
Bernhard, R.A.; Shibamoto, T.; Yamaguchi, K.; White, E., The volatile constituents of Schinus molle L., J. Agric. Food Chem., 1983, 31, 2, 463-466, https://doi.org/10.1021/jf00116a075 . [all data]

Yamaguchi and Shibamoto, 1981
Yamaguchi, K.; Shibamoto, T., Volatile constituents of green tea, Gyokuro (Camellia sinensis L. var Yabukita), J. Agric. Food Chem., 1981, 29, 2, 366-370, https://doi.org/10.1021/jf00104a035 . [all data]

Tressl, Friese, et al., 1978
Tressl, R.; Friese, L.; Fendesack, F.; Köppler, H., Studies of the volatile composition of hops during storage, J. Agric. Food Chem., 1978, 26, 6, 1426-1430, https://doi.org/10.1021/jf60220a036 . [all data]