Cyclotetrasilazane, 2,2,4,4,6,6,8,8-octamethyl-

Phase change data

Data compiled as indicated in comments:
BS - Robert L. Brown and Stephen E. Stein
TRC - Thermodynamics Research Center, NIST Boulder Laboratories, Chris Muzny director
AC - William E. Acree, Jr., James S. Chickos

Quantity Value Units Method Reference Comment
Tboil498.KN/APCR Inc., 1990BS
Quantity Value Units Method Reference Comment
Ttriple367.67KN/AMekhtiev and Karasharli, 1981Uncertainty assigned by TRC = 0.02 K; TRC

Enthalpy of vaporization

ΔvapH (kcal/mol) Temperature (K) Reference Comment
12.5450.Ditsent, Skorokhodov, et al., 1972Based on data from 388. - 513. K.; AC

Enthalpy of fusion

ΔfusH (kcal/mol) Temperature (K) Reference Comment
5.987367.7Domalski and Hearing, 1996AC

In addition to the Thermodynamics Research Center (TRC) data available from this site, much more physical and chemical property data is available from the following TRC products:

References

PCR Inc., 1990
PCR Inc., Research Chemicals Catalog 1990-1991, PCR Inc., Gainesville, FL, 1990, 1. [all data]

Mekhtiev and Karasharli, 1981
Mekhtiev, S.A.; Karasharli, K.A., Analysis of the results of thermodynamic studies of a series of organosilicon compounds, Azerb. Khim. Zhur., 1981, (5), 85-88. [all data]

Ditsent, Skorokhodov, et al., 1972
Ditsent, V.E.; Skorokhodov, I.I.; Terent'eva, N.A.; Zolotareva, M.N., Zh. Fiz. Khim., 1972, 46, 7, 1888. [all data]

Domalski and Hearing, 1996
Domalski, Eugene S.; Hearing, Elizabeth D., Heat Capacities and Entropies of Organic Compounds in the Condensed Phase. Volume III, J. Phys. Chem. Ref. Data, 1996, 25, 1, 1, https://doi.org/10.1063/1.555985 . [all data]