Ga2As

Gas phase ion energetics data

Data compiled by: John E. Bartmess

Electron affinity determinations

EA (eV) Method Reference Comment
2.457 ± 0.015LPESTaylor, Gomez, et al., 2001

References

Taylor, Gomez, et al., 2001
Taylor, T.R.; Gomez, H.; Asmis, K.R.; Neumark, D.M., Photoelectron spectroscopy of GaX2-, Ga2X-, Ga2X2-, and Ga2X3- (X=P,As), J. Chem. Phys., 2001, 115, 10, 4620-4631, https://doi.org/10.1063/1.1391267 . [all data]