1-Benzylpyrazole

Phase change data

Data compiled by: William E. Acree, Jr., James S. Chickos

Quantity Value Units Method Reference Comment
Δvap17.6 ± 0.48kcal/molCMó, Yáñez, et al., 1999

References

Mó, Yáñez, et al., 1999
Mó, Otilia; Yáñez, Manuel; Roux, María Victoria; Jiménez, Pilar; Dávalos, Juan Z.; Ribeiro da Silva, Manuel A.V.; Ribeiro da Silva, Maria das Dores M.C.; Matos, M. Agostinha R.; Amaral, Luisa M.P.F.; Sánchez-Migallón, Ana; Cabildo, Pilar; Claramunt, Rosa; Elguero, José; Liebman, Joel F., Enthalpies of Formation of N -Substituted Pyrazoles and Imidazoles, J. Phys. Chem. A, 1999, 103, 46, 9336-9344, https://doi.org/10.1021/jp992244f . [all data]