Cobalt, bis(2,4-pentanedithionato-s,s')-

Gas phase ion energetics data

Data compiled by: Sharon G. Lias, Rhoda D. Levin, and Sherif A. Kafafi

Ionization energy determinations

IE (eV) Method Reference Comment
7.20PECauletti, Furlani, et al., 1980Vertical value

References

Cauletti, Furlani, et al., 1980
Cauletti, C.; Furlani, C.; Storto, G., Coordinative bond d-shell ionisations in the UV photoelectron spectra of bis({beta}-diketonato) cobalt (II) copper (II) complexes, their thio analogues, J. Electron Spectrosc. Relat. Phenom., 1980, 18, 329. [all data]