N-deutero pyrrole

Phase change data

Data compiled by: William E. Acree, Jr., James S. Chickos

Enthalpy of vaporization

ΔvapH (kJ/mol) Temperature (K) Reference Comment
42.9300.Kimizuka and Szydlowski, 1992Based on data from 285. - 329. K.

References

Kimizuka and Szydlowski, 1992
Kimizuka, Wieslawa; Szydlowski, Jerzy, Vapor pressure isotope effect of n-deuterated pyrrole, Fluid Phase Equilibria, 1992, 77, 261-267, https://doi.org/10.1016/0378-3812(92)85107-J . [all data]