2-Hydroxy-4,4'-diethoxybenzophenone

Phase change data

Data compiled by: William E. Acree, Jr., James S. Chickos

Quantity Value Units Method Reference Comment
Δsub134.9kJ/molBPrice and Hawkins, 1999

Enthalpy of fusion

ΔfusH (kJ/mol) Temperature (K) Method Reference
34.7373.6DSCPrice and Hawkins, 1999

References

Price and Hawkins, 1999
Price, Duncan M.; Hawkins, Michael, Vapour pressures of hydroxybenzophenone UV absorbers, Thermochimica Acta, 1999, 329, 1, 73-76, https://doi.org/10.1016/S0040-6031(99)00005-2 . [all data]