Benzene, 1-bromo-4-phenoxy-

Normal alkane RI, non-polar column, temperature ramp

Data compiled by: NIST Mass Spectrometry Data Center, William E. Wallace, director

Column type CapillaryCapillary
Active phase Ultra-1SE-54
Column length (m) 25.25.
Carrier gas HeHe
Substrate
Column diameter (mm) 0.320.32
Phase thickness (μm) 0.25
Tstart (C) 80.50.
Tend (C) 260.250.
Heat rate (K/min) 3.8.
Initial hold (min)  2.
Final hold (min)  12.
I 1641.1685.
ReferenceOkumura, 1991Harland, Cumming, et al., 1986
Comment MSDC-RI MSDC-RI

References

Okumura, 1991
Okumura, T., retention indices of environmental chemicals on methyl silicone capillary column, Journal of Environmental Chemistry (Japan), 1991, 1, 2, 333-358, https://doi.org/10.5985/jec.1.333 . [all data]

Harland, Cumming, et al., 1986
Harland, B.J.; Cumming, R.I.; Gillings, E., The Kovats indexes of some organic micropollutants on an SE54 capillary column, EUR, I Org. Micropollut. Aquat. Environ., 1986, EUR 10388, 123-127. [all data]