Simetryn

Phase change data

Data compiled by: William E. Acree, Jr., James S. Chickos

Quantity Value Units Method Reference Comment
Δvap120. ± 6.kJ/molDSCVecchio and Brunetti, 2007
Δvap115. ± 4.kJ/molDSCVecchio and Brunetti, 2007

Enthalpy of vaporization

ΔvapH (kJ/mol) Temperature (K) Method Reference
88. ± 4.461.DSCVecchio and Brunetti, 2007
83.7 ± 1.3453.TGAVecchio and Brunetti, 2007

Enthalpy of sublimation

ΔsubH (kJ/mol) Temperature (K) Method Reference Comment
101.3338.GS-GCStephenson and Malanowski, 1987Based on data from 323. - 355. K. See also Friedrich and Stammbach, 1964.

Enthalpy of fusion

ΔfusH (kJ/mol) Temperature (K) Reference
24.0353.2Vecchio and Brunetti, 2007

Kovats' RI, non-polar column, isothermal

View large format table.

Column type Active phase Temperature (C) I Reference Comment
CapillaryOV-101190.1878.Valko and Lopata, 1982
CapillaryOV-101190.1878.Matisová, Krupcík, et al., 1979N2; Column length: 69.7 m; Column diameter: 0.24 mm

Kovats' RI, non-polar column, custom temperature program

View large format table.

Column type Active phase I Reference Comment
CapillaryHP-51902.Tanabe, Mitobe, et al., 200030. m/0.32 mm/0.25 μm; Program: 50C(1min) => 20C/min => 150C => 10C/min => 280C(4min)
CapillaryDB-5MS1910.Tanabe, Mitobe, et al., 199630. m/0.32 mm/0.25 μm; Program: 50 C(1min)->20C/min->200C->10C/min->280C (1.5min)

Kovats' RI, polar column, isothermal

View large format table.

Column type Active phase Temperature (C) I Reference Comment
PackedCarbowax 20M215.2915.Leclercq and Pacáková, 1979N2, Chromosorb W
PackedCarbowax 20M190.2937.Matisová, Krupcík, et al., 1979N2, Chromosorb W AW (80-100 mesh); Column length: 1.3 m
PackedCarbowax 20M215.2915.Pacáková and Nemec, 1978N2, Chromosorb W; Column length: 1.4 m

Van Den Dool and Kratz RI, non-polar column, custom temperature program

View large format table.

Column type Active phase I Reference Comment
CapillaryOV-1011843.Yasuhara, Shiraishi, et al., 199715. m/0.25 mm/0.25 μm, He; Program: 50C(2min) => (20C/min) => 120C => (7C/min) => 310C(10min)
Capillary5 % Phenyl methyl siloxane1899.Yasuhara, Shiraishi, et al., 199725. m/0.31 mm/0.52 μm, He; Program: 50C(2min) => (20C/min) => 120C => (7C/min) => 310C(10min)

Normal alkane RI, non-polar column, custom temperature program

View large format table.

Column type Active phase I Reference Comment
Capillary5 % Phenyl methyl siloxane1906.Department of Food Safety and Welfare, 200630. m/0.25 mm/0.25 μm, Helium; Program: 50 0C(1 min) 25 0C/min -> 125 0C 10 0C/min -> 300 0C (10 min)
CapillaryHP-51902.Kawara, Asada, et al., 200530. m/0.25 mm/0.25 μm; Program: 50 0C (1 min) 20 0C/min -> 150 0C 10 0C/min -> 280 0C
CapillaryUltra-11844.Tameo and Kiyos, 1991Program: not specified

Normal alkane RI, polar column, custom temperature program

View large format table.

Column type Active phase I Reference Comment
CapillaryCarbowax 400, Carbowax 20M, Carbowax 1540, Carbowax 4000, Superox 06, PEG 20M, etc.2915.Waggott and Davies, 1984Hydrogen; Column length: 50. m; Column diameter: 0.32 mm; Program: not specified

References

Vecchio and Brunetti, 2007
Vecchio, Stefano; Brunetti, Bruno, Vapor Pressures and Standard Molar Sublimation Enthalpies of Three 6-Methylthio-2,4-di(alkylamino)-1,3,5-triazine Derivatives: Simetryn, Ametryn, and Terbutryn, J. Chem. Eng. Data, 2007, 52, 5, 1585-1594, https://doi.org/10.1021/je600580r . [all data]

Stephenson and Malanowski, 1987
Stephenson, Richard M.; Malanowski, Stanislaw, Handbook of the Thermodynamics of Organic Compounds, 1987, https://doi.org/10.1007/978-94-009-3173-2 . [all data]

Friedrich and Stammbach, 1964
Friedrich, K.; Stammbach, K., Gas chromatographic determination of small vapour pressures determination of the vapour pressures of some triazine herbicides, Journal of Chromatography A, 1964, 16, 22-28, https://doi.org/10.1016/S0021-9673(01)82436-5 . [all data]

Valko and Lopata, 1982
Valko, K.; Lopata, A., Applicability of Gas-Liquid Chromatography in Determining Liquid-Liquid Partition Data, J. Chromatogr., 1982, 252, 77-90, https://doi.org/10.1016/S0021-9673(01)88399-0 . [all data]

Matisová, Krupcík, et al., 1979
Matisová, E.; Krupcík, J.; Líska, O.; Szentiványi, N., Qualitative analysis of multi-component s-triazine herbicides by gas-liquid chromatography, J. Chromatogr., 1979, 169, 261-269, https://doi.org/10.1016/0021-9673(75)85049-7 . [all data]

Tanabe, Mitobe, et al., 2000
Tanabe, A.; Mitobe, H.; Kawata, K.; Sakai, M.; Yasuhara, A., New monitoring system for ninety pesticides and related compounds in river water by solid-phase extraction with determination by gas chromatography/mass spectrometry, J. AOAC Int., 2000, 83, 1, 61-77. [all data]

Tanabe, Mitobe, et al., 1996
Tanabe, A.; Mitobe, H.; Kawata, K.; Sakai, M., Monitoring of herbicides in river water by gas chromatography-mass spectrometry and solid-phase extraction, J. Chromatogr. A, 1996, 754, 1-2, 159-168, https://doi.org/10.1016/S0021-9673(96)00221-X . [all data]

Leclercq and Pacáková, 1979
Leclercq, P.A.; Pacáková, V., Gas Chromatography and Mass Spectrometry of Bis(alkylamino)-s-triazines, J. Chromatogr., 1979, 178, 1, 193-207, https://doi.org/10.1016/S0021-9673(00)89708-3 . [all data]

Pacáková and Nemec, 1978
Pacáková, V.; Nemec, I., Gas chromatographic, spectrophotometric and electrochemical behaviour of subsitituted s-triazines, J. Chromatogr., 1978, 148, 1, 273-281, https://doi.org/10.1016/S0021-9673(00)99348-8 . [all data]

Yasuhara, Shiraishi, et al., 1997
Yasuhara, A.; Shiraishi, H.; Nishikawa, M.; Yamamoto, T.; Uehiro, T.; Nakasugi, O.; Okumura, T.; Kenmotsu, K.; Fukui, H.; Nagase, M.; Ono, Y.; Kawagoshi, Y.; Baba, K.; Noma, Y., Determination of organic components in leachates from hazardous waste disposal sites in Japan by gas chromatography-mass spectrometry, J. Chromatogr. A, 1997, 774, 1-2, 321-332, https://doi.org/10.1016/S0021-9673(97)00078-2 . [all data]

Department of Food Safety and Welfare, 2006
Department of Food Safety, Ministry of Health; Welfare, Analytical methods for residual compositional substances of agricultural chemicals, feed aadditives, and veterinary drugs in foods, 2006, retrieved from http://www.mhlw.go.jp/english/topics/foodsafety/positivelist060228/de/060526-1a.pdf. [all data]

Kawara, Asada, et al., 2005
Kawara, K.; Asada, T.; Oikawa, K.; Tanabe, A., Multiresidue determination of pesticides in sediments by ultrasonically assisted extraction and gas chromatography/mass spectrometry, J. AOAC International, 2005, 88, 5, 1440-1451. [all data]

Tameo and Kiyos, 1991
Tameo, O.; Kiyos, I., Simultaneous determination of pesticides by capillary gas chromatography, Cannot be traslated (in Japan), 1991, 14, 2, 109-122. [all data]

Waggott and Davies, 1984
Waggott, A.; Davies, I.W., Identification of organic pollutants using linear temperature programmed retention indices (LTPRIs) - Part II, 1984, retrieved from http://dwi.defra.gov.uk/research/completed-research/reports/dwi0383.pdf. [all data]