zinc iodide

Gas phase ion energetics data

Data compiled as indicated in comments:
LBLHLM - Sharon G. Lias, John E. Bartmess, Joel F. Liebman, John L. Holmes, Rhoda D. Levin, and W. Gary Mallard
LLK - Sharon G. Lias, Rhoda D. Levin, and Sherif A. Kafafi

Ionization energy determinations

IE (eV) Method Reference Comment
10.3EIHilpert, Bencivenni, et al., 1985LBLHLM
9.76PEBerkowitz, 1974Vertical value; LLK
9.73 ± 0.05PECocksey, Eland, et al., 1973Vertical value; LLK
9.7PEBoggess, Allen, et al., 1973Vertical value; LLK

Appearance energy determinations

Ion AE (eV) Other Products MethodReferenceComment
I+16.0ZnIEIHilpert, Bencivenni, et al., 1985LBLHLM
ZnI+12.4IEIHilpert, Bencivenni, et al., 1985LBLHLM
I2+12.7ZnEIHilpert, Bencivenni, et al., 1985LBLHLM
Zn+14.7I2EIHilpert, Bencivenni, et al., 1985LBLHLM

References

Hilpert, Bencivenni, et al., 1985
Hilpert, K.; Bencivenni, L.; Saha, B., Thermochemistry of the molecule (ZnI2)2(g) and the vaporization of ZnI2(s), J. Chem. Phys., 1985, 83, 5227. [all data]

Berkowitz, 1974
Berkowitz, J., PES of high-temperature vapors. VI. 304 A and 584 APES of Zn, Cd, and Hg halides and the electronegativity scale, J. Chem. Phys., 1974, 61, 407. [all data]

Cocksey, Eland, et al., 1973
Cocksey, B.G.; Eland, J.H.D.; Danby, C.J., Photoelectron spectra of the zinc and cadmium halides, J. Chem. Soc. Faraday Trans. 2, 1973, 69, 1558. [all data]

Boggess, Allen, et al., 1973
Boggess, G.W.; Allen, J.D., Jr.; Schweitzer, G.K., The photoelectron spectra of gaseous zinc(II) and cadmium(II) chlorides, bromides, and iodides, J. Electron Spectrosc. Relat. Phenom., 1973, 2, 467. [all data]