2-Propenal, 2-methyl-3-phenyl-

Phase change data

Data compiled as indicated in comments:
BS - Robert L. Brown and Stephen E. Stein
AC - William E. Acree, Jr., James S. Chickos

Reduced pressure boiling point

Tboil (K) Pressure (bar) Reference Comment
421.70.036Aldrich Chemical Company Inc., 1990BS

Enthalpy of vaporization

ΔvapH (kJ/mol) Temperature (K) Method Reference Comment
59.3 ± 0.2400.EBSteele, Chirico, et al., 2002Based on data from 401. - 556. K.; AC
56.3 ± 0.2440.EBSteele, Chirico, et al., 2002Based on data from 401. - 556. K.; AC
53.4 ± 0.2480.EBSteele, Chirico, et al., 2002Based on data from 401. - 556. K.; AC
50.5 ± 0.4520.EBSteele, Chirico, et al., 2002Based on data from 401. - 556. K.; AC
47.7 ± 0.6560.EBSteele, Chirico, et al., 2002Based on data from 401. - 556. K.; AC
71.5358.AStephenson and Malanowski, 1987Based on data from 343. - 393. K.; AC

References

Aldrich Chemical Company Inc., 1990
Aldrich Chemical Company Inc., Catalog Handbook of Fine Chemicals, Aldrich Chemical Company, Inc., Milwaukee WI, 1990, 1. [all data]

Steele, Chirico, et al., 2002
Steele, W.V.; Chirico, R.D.; Cowell, A.B.; Knipmeyer, S.E.; Nguyen, A., Thermodynamic Properties and Ideal-Gas Enthalpies of Formation for trans -Methyl Cinnamate, α-Methyl Cinnamaldehyde, Methyl Methacrylate, 1-Nonyne, Trimethylacetic Acid, Trimethylacetic Anhydride, and Ethyl Trimethyl Acetate, J. Chem. Eng. Data, 2002, 47, 4, 700-714, https://doi.org/10.1021/je010086r . [all data]

Stephenson and Malanowski, 1987
Stephenson, Richard M.; Malanowski, Stanislaw, Handbook of the Thermodynamics of Organic Compounds, 1987, https://doi.org/10.1007/978-94-009-3173-2 . [all data]