1-(2-Pentyl)-4-(3-pentyl)benzene

Reaction thermochemistry data

Data compiled by: Hussein Y. Afeefy, Joel F. Liebman, and Stephen E. Stein

Individual Reactions

1-(2-Pentyl)-4-(3-pentyl)benzene = Benzene, 1-(1-ethylpropyl)-3-(1-methylbutyl)-

By formula: C16H26 = C16H26

Quantity Value Units Method Reference Comment
Δr-0.072 ± 0.062kcal/molEqkNesterova, Pimerzin, et al., 1984liquid phase; At 326.5 K, see Pimerzin, Nesterova, et al., 1985, see Pimerzin, Nesterova, et al., 1986

1-(2-Pentyl)-4-(3-pentyl)benzene = 1,4-Bis(2-pentyl)benzene

By formula: C16H26 = C16H26

Quantity Value Units Method Reference Comment
Δr-0.10 ± 0.067kcal/molEqkPimerzin, Nesterova, et al., 1985liquid phase; AlCl3

References

Nesterova, Pimerzin, et al., 1984
Nesterova, T.N.; Pimerzin, A.A.; Rozhnov, A.M.; Roshchupkina, I.Ya., Thermodynamics of aromatic hydrocarbons, Probl. Kalorim. Khim. Termodin., Dokl. Vses. Konf., 10th, 1984, 1, 225-227. [all data]

Pimerzin, Nesterova, et al., 1985
Pimerzin, a.A.; Nesterova, T.N.; Rozhnov, A.M., Equilibria of isomeric transformations and relations between thermodynamic properties of secondary alkylbenzenes, J. Chem. Thermodyn., 1985, 17, 641-648. [all data]

Pimerzin, Nesterova, et al., 1986
Pimerzin, A.A.; Nesterova, T.N.; Rozhnov, A.M., Equilibria of isomeric transformations and relations between thermodynamic properties of secondary alkylbenzenes, J. Chem. Thermodyn., 1986, 17, 641-648. [all data]