Barban

Phase change data

Data compiled as indicated in comments:
TRC - Thermodynamics Research Center, NIST Boulder Laboratories, Chris Muzny director
AC - William E. Acree, Jr., James S. Chickos

Quantity Value Units Method Reference Comment
Tfus345.59KN/ADonnelly, Drewes, et al., 1990Uncertainty assigned by TRC = 0.2 K; TRC

Enthalpy of fusion

ΔfusH (kJ/mol) Temperature (K) Method Reference Comment
26.91344.1DSCDonnelly, Drewes, et al., 1990, 2AC

In addition to the Thermodynamics Research Center (TRC) data available from this site, much more physical and chemical property data is available from the following TRC products:

Kovats' RI, non-polar column, temperature ramp

Data compiled by: NIST Mass Spectrometry Data Center, William E. Wallace, director

Column type Capillary
Active phase DB-1
Column length (m) 15.
Carrier gas He
Substrate
Column diameter (mm) 0.25
Phase thickness (μm)
Tstart (C) 100.
Tend (C) 270.
Heat rate (K/min) 6.
Initial hold (min)
Final hold (min)
I 2126.
ReferenceHall, Whitehead, et al., 1986
Comment MSDC-RI

References

Donnelly, Drewes, et al., 1990
Donnelly, J.R.; Drewes, L.A.; Johnson, R.L.; Munslow, W.D.; Knapp, K.K.; Sovocool, G.W., Purity and heat of fusion data for environmental standards as determined by differential scanning calorimetry, Thermochim. Acta, 1990, 167, 2, 155, https://doi.org/10.1016/0040-6031(90)80476-F . [all data]

Donnelly, Drewes, et al., 1990, 2
Donnelly, J.R.; Drewes, L.A.; Johnson, R.L.; Munslow, W.D.; Knapp, K.K.; Sovocool, G.W., Purity and heat of fusion data for environmental standards as determined by differential scanning calorimetry, Thermochimica Acta, 1990, 167, 2, 155-187, https://doi.org/10.1016/0040-6031(90)80476-F . [all data]