(Chloromethyl)silane

Phase change data

Data compiled by: William E. Acree, Jr., James S. Chickos

Enthalpy of vaporization

ΔvapH (kJ/mol) Temperature (K) Reference Comment
27.5271.Angyal, McHugh, et al., 1957Based on data from 246. - 297. K.

References

Angyal, McHugh, et al., 1957
Angyal, S.J.; McHugh, D.J.; Gilham, P.T.; Kaesz, H.D.; Stone, F.G.A.; Ferrier, R.J.; Tedder, J.M.; Gore, P.H.; Everest, D.A.; Harrison, J.H.; Fanta, Paul E.; Moffatt, J.S.; Lawson, Alexander, Notes, J. Chem. Soc., 1957, 1432, https://doi.org/10.1039/jr9570001432 . [all data]