calcium iodide

Gas phase thermochemistry data

Quantity Value Units Method Reference Comment
Δfgas-61.699kcal/molReviewChase, 1998Data last reviewed in June, 1974
Quantity Value Units Method Reference Comment
gas,1 bar78.291cal/mol*KReviewChase, 1998Data last reviewed in June, 1974

Gas Phase Heat Capacity (Shomate Equation)

Cp° = A + B*t + C*t2 + D*t3 + E/t2
H° − H°298.15= A*t + B*t2/2 + C*t3/3 + D*t4/4 − E/t + F − H
S° = A*ln(t) + B*t + C*t2/2 + D*t3/3 − E/(2*t2) + G
    Cp = heat capacity (cal/mol*K)
    H° = standard enthalpy (kcal/mol)
    S° = standard entropy (cal/mol*K)
    t = temperature (K) / 1000.

View plot Requires a JavaScript / HTML 5 canvas capable browser.

View table.

Temperature (K) 2500. - 6000.
A 14.88740
B 0.014136
C -0.003828
D 0.000326
E -0.035727
F -66.25920
G 96.10129
H -61.70010
ReferenceChase, 1998
Comment Data last reviewed in June, 1974

Condensed phase thermochemistry data

Quantity Value Units Method Reference Comment
Δfliquid-119.54kcal/molReviewChase, 1998Data last reviewed in June, 1974
Quantity Value Units Method Reference Comment
liquid,1 bar42.770cal/mol*KReviewChase, 1998Data last reviewed in June, 1974
Quantity Value Units Method Reference Comment
Δfsolid-128.30kcal/molReviewChase, 1998Data last reviewed in June, 1974
Quantity Value Units Method Reference Comment
solid34.725cal/mol*KReviewChase, 1998Data last reviewed in June, 1974

Liquid Phase Heat Capacity (Shomate Equation)

Cp° = A + B*t + C*t2 + D*t3 + E/t2
H° − H°298.15= A*t + B*t2/2 + C*t3/3 + D*t4/4 − E/t + F − H
S° = A*ln(t) + B*t + C*t2/2 + D*t3/3 − E/(2*t2) + G
    Cp = heat capacity (cal/mol*K)
    H° = standard enthalpy (kcal/mol)
    S° = standard entropy (cal/mol*K)
    t = temperature (K) / 1000.

View plot Requires a JavaScript / HTML 5 canvas capable browser.

View table.

Temperature (K) 1052. - 2500.
A 24.70010
B -1.823350×10-8
C 9.424671×10-9
D -1.635730×10-9
E -1.871841×10-9
F -129.0410
G 68.01530
H -119.5440
ReferenceChase, 1998
Comment Data last reviewed in June, 1974

Solid Phase Heat Capacity (Shomate Equation)

Cp° = A + B*t + C*t2 + D*t3 + E/t2
H° − H°298.15= A*t + B*t2/2 + C*t3/3 + D*t4/4 − E/t + F − H
S° = A*ln(t) + B*t + C*t2/2 + D*t3/3 − E/(2*t2) + G
    Cp = heat capacity (cal/mol*K)
    H° = standard enthalpy (kcal/mol)
    S° = standard entropy (cal/mol*K)
    t = temperature (K) / 1000.

View plot Requires a JavaScript / HTML 5 canvas capable browser.

View table.

Temperature (K) 298. - 1052.
A 17.08150
B 4.600471
C 0.107077
D -0.033085
E -0.001899
F -133.6050
G 54.00920
H -128.3000
ReferenceChase, 1998
Comment Data last reviewed in June, 1974

Gas phase ion energetics data

Data compiled as indicated in comments:
LBLHLM - Sharon G. Lias, John E. Bartmess, Joel F. Liebman, John L. Holmes, Rhoda D. Levin, and W. Gary Mallard
LLK - Sharon G. Lias, Rhoda D. Levin, and Sherif A. Kafafi

Ionization energy determinations

IE (eV) Method Reference Comment
9.6SEmons, Kiessling, et al., 1982LBLHLM
8.7PELee and Potts, 1979LLK
9.39 ± 0.04PELee and Potts, 1979Vertical value; LLK
10.1PEHammer, Allen, et al., 1978Vertical value; LLK

Appearance energy determinations

Ion AE (eV) Other Products MethodReferenceComment
CaI+9.95ISEmons, Kiessling, et al., 1982LBLHLM

References

Chase, 1998
Chase, M.W., Jr., NIST-JANAF Themochemical Tables, Fourth Edition, J. Phys. Chem. Ref. Data, Monograph 9, 1998, 1-1951. [all data]

Emons, Kiessling, et al., 1982
Emons, H.-H.; Kiessling, D.; Horlbeck, W., Dampfdruckmessungen und massenspektrometrische untersuchungen der gasphase uber erdalkalimetallhalogeniden, Z. Anorg. Allg. Chem., 1982, 488, 219. [all data]

Lee and Potts, 1979
Lee, E.P.F.; Potts, A.W., An investigation of the valence shell electronic structure of alkaline earth halides by using Ab initio S. C. F. calculations and photoelectron spectroscopy, Proc. R. Soc. London A:, 1979, 365, 395. [all data]

Hammer, Allen, et al., 1978
Hammer, C.A.; Allen, J.D., Jr.; Cusachs, L.C.; Schweitzer, G.K., The high-temperature photoelectron spectra of alkaline-earth chlorides and iodides, J. Electron Spectrosc. Relat. Phenom., 1978, 13, 149. [all data]