HOAsO2

Vibrational and/or electronic energy levels

Data compiled by: Marilyn E. Jacox

State:   X

Vib.
sym.
 No.   Approximate
 type of mode
 cm-1   Med.   Method   References

OH stretch 3613 Ar IR Andrews, Withnall, et al., 1989
AsO2 a-stretch 1061.4 Ar IR Andrews, Withnall, et al., 1989
HOAs deform. 948 Ar IR Andrews, Withnall, et al., 1989
AsO2 s-stretch 932.2 Ar IR Andrews, Withnall, et al., 1989
As-O stretch 725 Ar IR Andrews, Withnall, et al., 1989
Torsion 424 Ar IR Andrews, Withnall, et al., 1989
Torsion 414 Ar IR Andrews, Withnall, et al., 1989

Additional references: Jacox, 1994, page 273

References

Andrews, Withnall, et al., 1989
Andrews, L.; Withnall, R.; Moores, B.W., Infrared spectra of arsine-ozone complexes, reaction products, and photolysis products in solid argon, J. Phys. Chem., 1989, 93, 4, 1279, https://doi.org/10.1021/j100341a022 . [all data]

Jacox, 1994
Jacox, M.E., Vibrational and electronic energy levels of polyatomic transient molecules, American Chemical Society, Washington, DC, 1994, 464. [all data]