Ethanone, 1,1'-(1,4-phenylene)bis-

Normal alkane RI, non-polar column, temperature ramp

Data compiled by: NIST Mass Spectrometry Data Center, William E. Wallace, director

Column type Capillary
Active phase SPB-5
Column length (m) 60.
Carrier gas Helium
Substrate
Column diameter (mm) 0.32
Phase thickness (μm) 1.0
Tstart (C) 30.
Tend (C) 230.
Heat rate (K/min) 3.
Initial hold (min)
Final hold (min)
I 1451.
ReferenceSebastian, Viallon-Fernandez, et al., 2003
Comment MSDC-RI

References

Sebastian, Viallon-Fernandez, et al., 2003
Sebastian, I.; Viallon-Fernandez, C.; Berge, P.; Berdague, J.-L., Analysis of the volatile fraction of lamb fat tissue: influence of the type of feeding, Sciences des Aliments, 2003, 23, 4, 497-511, https://doi.org/10.3166/sda.23.497-511 . [all data]