Naphthalene, 2,6-bis(methylthio)-

Gas phase ion energetics data

Data compiled as indicated in comments:
LLK - Sharon G. Lias, Rhoda D. Levin, and Sherif A. Kafafi

Ionization energy determinations

IE (eV) Method Reference Comment
7.59PEBock and Brahler, 1979Vertical value; LLK
7.59PEBock and Brahler, 1977Vertical value; LLK

References

Bock and Brahler, 1979
Bock, H.; Brahler, U.G., Oxidation und Reduktion methylthio-substitierter Naphthaline - ein Vergleich von Molekulzustanden, Chem. Ber., 1979, 112, 3081. [all data]

Bock and Brahler, 1977
Bock, H.; Brahler, G., Oxidation und Reduktion methylthio-substituierter π-Systeme und die Elektronenverteilung in ihren Radikalionen, Angew. Chem., 1977, 89, 893. [all data]