Ethanethiol, 2-(diethylamino)-

Phase change data

Data compiled by: William E. Acree, Jr., James S. Chickos

Enthalpy of vaporization

ΔvapH (kcal/mol) Temperature (K) Method Reference Comment
8.46293.AStephenson and Malanowski, 1987Based on data from 278. - 370. K.

Normal alkane RI, non-polar column, temperature ramp

View large format table.

Column type Active phase I Reference Comment
CapillaryDB-5976.Savel'eva, Zenkevich, et al., 200325. m/0.20 mm/0.33 μm, Helium, 40. C @ 1. min, 5. K/min, 270. C @ 15. min
CapillaryDB-5976.Savel'eva, Zenkevich, et al., 200225. m/0.20 mm/0.33 μm, Helium, 40. C @ 1. min, 5. K/min, 270. C @ 15. min

Normal alkane RI, non-polar column, custom temperature program

View large format table.

Column type Active phase I Reference Comment
CapillaryMethyl Silicone976.Savelieva and Zenkevich I., 2003Program: not specified
CapillaryMethyl Silicone979.Savelieva and Zenkevich I., 2003Program: not specified
CapillaryPolydimethyl siloxanes979.Zenkevich and Chupalov, 1996Program: not specified

References

Stephenson and Malanowski, 1987
Stephenson, Richard M.; Malanowski, Stanislaw, Handbook of the Thermodynamics of Organic Compounds, 1987, https://doi.org/10.1007/978-94-009-3173-2 . [all data]

Savel'eva, Zenkevich, et al., 2003
Savel'eva, E.I.; Zenkevich, I.G.; Radilov, A.S., Identification the Products of Chemical Neutralization of O-Isobutyl-S-(2-diethylaminoethyl)methylthiophosphonate in the Composition of Bitumen-Salt Matrices, Zh. Anal. Khim. (Rus.), 2003, 58, 2, 135-145. [all data]

Savel'eva, Zenkevich, et al., 2002
Savel'eva, E.I.; Zenkevich, I.G.; Kuznetsova, T.A.; Radilov, A.S.; Pshenichnaya, G.V., Investigation of Products of Transformation of Phosphororganic Toxic Substances with Gas Chromatography - Mass Spectrometry, Rus. Khim. Zh. (Rus.), 2002, 56, 6, 82-91. [all data]

Savelieva and Zenkevich I., 2003
Savelieva, E.; Zenkevich I., Analisi GC/MS di agenti chimici nervini, Laboratorio 2000, 2003, 17, 6/7, 24-26. [all data]

Zenkevich and Chupalov, 1996
Zenkevich, I.G.; Chupalov, A.A., New Possibilities of Chromato Mass Pectrometric Identification of Organic Compounds Using Increments of Gas Chromatographic Retention Indices of Molecular Structural Fragments, Zh. Org. Khim. (Rus.), 1996, 32, 5, 656-666. [all data]