Pyridine, 3-methyl-, 1-oxide

Condensed phase thermochemistry data

Data compiled by: Hussein Y. Afeefy, Joel F. Liebman, and Stephen E. Stein

Quantity Value Units Method Reference Comment
Δfsolid8.8 ± 0.7kJ/molCmAiroldi and Goncalves, 1992

Phase change data

Data compiled by: William E. Acree, Jr., James S. Chickos

Quantity Value Units Method Reference Comment
Δsub82.2 ± 2.4kJ/molCAcree Jr., 1995

References

Airoldi and Goncalves, 1992
Airoldi, C.; Goncalves, L.J., Standard molar enthalpies of formation of some crystalline amine N-oxides, Thermochim. Acta, 1992, 194, 259-266. [all data]

Acree Jr., 1995
Acree Jr., Enthalpies of combustion of 4-nitropyridineN-oxide and pyridine-3-carboxylic acidN-oxide: the dissociation enthalpies of the N---O bonds in pyridineN-oxide derivatives, The Journal of Chemical Thermodynamics, 1995, 27, 4, 391-398, https://doi.org/10.1006/jcht.1995.0038 . [all data]