Butanoic acid, 3-methyl-, hexyl ester

Normal alkane RI, polar column, custom temperature program

Data compiled by: NIST Mass Spectrometry Data Center, William E. Wallace, director

Column type CapillaryCapillaryCapillaryCapillary
Active phase DB-FFAPHP-InnowaxInnowaxCross-linked FFAP
Column length (m) 30.60.60.50.
Carrier gas  NitrogenHeN2
Substrate
Column diameter (mm) 0.320.250.250.2
Phase thickness (μm) 0.250.250.250.33
Program 35C(2min) => 40C/min => 50C(2min) => 6C/min => 180C => 10C/min => 230C(10min)50 0C (4 min) -> 40 0C 4 0C/min -> 220 0C60 0C (10 min) 4 K/min -> 220 0C (10 min) 1 K/min -> 240 0C70C(1min) => 3C/min => 142C (2min) => 25C/min => 230C(5min)
I 1430.1432.1457.1442.
ReferenceLasekan, Buettner, et al., 2007Quijano and Pino, 2006Baser, Özek, et al., 2000Lavilla, Puy, et al., 1999
Comment MSDC-RI MSDC-RI MSDC-RI MSDC-RI

Normal alkane RI, non-polar column, custom temperature program

Data compiled by: NIST Mass Spectrometry Data Center, William E. Wallace, director

Column type CapillaryCapillaryCapillaryCapillary
Active phase SE-54SE-30DB-1DB-1
Column length (m) 30. 30.30.
Carrier gas   H2H2
Substrate
Column diameter (mm) 0.32 0.250.25
Phase thickness (μm) 0.25 0.250.25
Program 35C(2min) => 40C/min => 60C(2min) => 6C/min => 180C => 10C/min => 230C(10min)not specified30C (2min) => 2C/min => 150C => 4C/min => 250C30C (2min) => 2C/min => 150C => 4C/min => 250C
I 1244.1204.1225.1225.
ReferenceLasekan, Buettner, et al., 2007Liu, Liang, et al., 2007Takeoka, Flath, et al., 1988Takeoka, Flath, et al., 1988
Comment MSDC-RI MSDC-RI MSDC-RI MSDC-RI

Kovats' RI, non-polar column, isothermal

Data compiled by: NIST Mass Spectrometry Data Center, William E. Wallace, director

Column type Packed
Active phase SE-30
Column length (m) 3.7
Carrier gas
Substrate Celaton (62-72 mesh)
Column diameter (mm)
Phase thickness (μm)
Temperature (C) 150.
I 1204.
ReferenceAshes and Haken, 1974
Comment MSDC-RI

Van Den Dool and Kratz RI, polar column, temperature ramp

Data compiled by: NIST Mass Spectrometry Data Center, William E. Wallace, director

Column type CapillaryCapillary
Active phase DB-WaxDB-Wax
Column length (m) 30.30.
Carrier gas HeHe
Substrate
Column diameter (mm) 0.250.25
Phase thickness (μm) 0.250.25
Tstart (C) 50.50.
Tend (C) 250.250.
Heat rate (K/min) 4.4.
Initial hold (min) 3.3.
Final hold (min)
I 1425.1425.
ReferenceFröhlich, Duque, et al., 1989Fröhlich, Duque, et al., 1989
Comment MSDC-RI MSDC-RI

References

Lasekan, Buettner, et al., 2007
Lasekan, O.; Buettner, A.; Christlbauer, M., Investigation of important odorants of palm wine (Elaeis guineensis), Food Chem., 2007, 105, 1, 15-23, https://doi.org/10.1016/j.foodchem.2006.12.052 . [all data]

Quijano and Pino, 2006
Quijano, C.E.; Pino, J.A., Changes in volatile constituents during the ripening of cocona (Solanum sessiliflorum Dunal) fruit, Revista CENIC Ciencias Quimicas, 2006, 37, 3, 133-136. [all data]

Baser, Özek, et al., 2000
Baser, K.H.C.; Özek, T.; Demirci, B.; Duman, H., Composition of the essential oil of Prangos heyniae H. Duman et M. F. Watson, a new endemic from Turkey, Flavour Fragr. J., 2000, 15, 1, 47-49, https://doi.org/10.1002/(SICI)1099-1026(200001/02)15:1<47::AID-FFJ869>3.0.CO;2-9 . [all data]

Lavilla, Puy, et al., 1999
Lavilla, T.; Puy, J.; López, M.L.; Recasens, I.; Vendrell, M., Relationships between volatile production, fruit quality, and sensory evaluation in Granny Smith apples stored in different controlled-atmosphere treatments by means of multivariate analysis, J. Agric. Food Chem., 1999, 47, 9, 3791-3803, https://doi.org/10.1021/jf990066h . [all data]