Heptane, 1,1-dimethoxy-

Normal alkane RI, non-polar column, temperature ramp

Data compiled by: NIST Mass Spectrometry Data Center, William E. Wallace, director

Column type Capillary
Active phase HP-5MS
Column length (m) 30.
Carrier gas He
Substrate
Column diameter (mm) 0.25
Phase thickness (μm) 0.25
Tstart (C) 50.
Tend (C) 250.
Heat rate (K/min) 4.
Initial hold (min)
Final hold (min)
I 1080.
ReferenceHadaruga, Hadaruga, et al., 2006
Comment MSDC-RI

Normal alkane RI, non-polar column, custom temperature program

View large format table.

Column type Active phase I Reference Comment
CapillarySE-301069.Vinogradov, 2004Program: not specified
CapillarySE-301063.Vinogradov, 2004Program: not specified

Normal alkane RI, polar column, custom temperature program

View large format table.

Column type Active phase I Reference Comment
CapillaryCarbowax 20M1265.Vinogradov, 2004Program: not specified
CapillaryCarbowax 20M1261.Vinogradov, 2004Program: not specified

References

Hadaruga, Hadaruga, et al., 2006
Hadaruga, N.G.; Hadaruga, D.I.; Paunescu, V.; Tatu, C.; Ordodi, V.L.; Bandur, G.; Lupea, A.X., Thermal stability of the linoleic acid/α- and β-cyclodextrin complexes, Food Chem., 2006, 99, 3, 500-508, https://doi.org/10.1016/j.foodchem.2005.08.012 . [all data]