Acetic acid, 2-ethylbutyl ester

Kovats' RI, non-polar column, isothermal

Data compiled by: NIST Mass Spectrometry Data Center, William E. Wallace, director

Column type CapillaryPackedPacked
Active phase OV-1Apiezon LApiezon L
Column length (m)
Carrier gas
Substrate  Celite 545Celite 545
Column diameter (mm)
Phase thickness (μm)
Temperature (C) 333.120.160.
I 957.919.925.
ReferenceHu, Lu, et al., 2006Bogoslovsky, Anvaer, et al., 1978Bogoslovsky, Anvaer, et al., 1978
Comment MSDC-RI MSDC-RI MSDC-RI

References

Hu, Lu, et al., 2006
Hu, X.-F.; Lu, C.-H.; Yin, C.-S., Modeling Gas Chromatographic Retention Indices of Oxygen-containing Compounds by Novel Atom-type Topological Indices, Chinese Journal of Chemical Physics, 2006, 19, 3, 243-247, https://doi.org/10.1360/cjcp2006.19(3).243.5 . [all data]

Bogoslovsky, Anvaer, et al., 1978
Bogoslovsky, Yu.N.; Anvaer, B.I.; Vigdergauz, M.S., Chromatographic constants in gas chromatography (in Russian), Standards Publ. House, Moscow, 1978, 192. [all data]