Dihydro-3-(2H)-thiophenone

Normal alkane RI, polar column, temperature ramp

Data compiled by: NIST Mass Spectrometry Data Center, William E. Wallace, director

Column type CapillaryCapillaryCapillaryCapillaryCapillary
Active phase AT-WaxAT-WaxDB-WaxDB-WaxHP-Wax
Column length (m) 60.60.30.60.60.
Carrier gas HeliumHeliumHeHeHe
Substrate
Column diameter (mm) 0.250.250.250.250.25
Phase thickness (μm) 0.250.250.250.250.5
Tstart (C) 60.60.40.40.40.
Tend (C) 280.280.210.210.190.
Heat rate (K/min) 4.4.5.5.3.
Initial hold (min)     6.
Final hold (min)
I 1573.1557.1563.1565.1565.
ReferenceKiss, Csoka, et al., 2011Kiss, Csoka, et al., 2011Kumazawa and Masuda, 2002Kumazawa and Masuda, 2002Sanz, Maeztu, et al., 2002
Comment MSDC-RI MSDC-RI MSDC-RI MSDC-RI MSDC-RI
Column type CapillaryCapillary
Active phase DB-WaxDB-Wax
Column length (m) 30.60.
Carrier gas HeHe
Substrate
Column diameter (mm) 0.530.32
Phase thickness (μm) 1.0.25
Tstart (C) 40.60.
Tend (C) 210.220.
Heat rate (K/min) 5.3.
Initial hold (min)
Final hold (min)
I 1570.1553.
ReferenceKumazawa and Masuda, 2001Guntert, Brüning, et al., 1990
Comment MSDC-RI MSDC-RI

Condensed phase thermochemistry data

Data compiled by: Hussein Y. Afeefy, Joel F. Liebman, and Stephen E. Stein

Quantity Value Units Method Reference Comment
Δcliquid-2848. ± 1.7kJ/molCcbGeiseler and Sawistowsky, 1972

Van Den Dool and Kratz RI, non-polar column, temperature ramp

Data compiled by: NIST Mass Spectrometry Data Center, William E. Wallace, director

Column type CapillaryCapillaryCapillaryCapillaryCapillary
Active phase CP Sil 8 CBBPX-5DB-5SE-30OV-101
Column length (m) 50.50.30.50.50.
Carrier gas    HeHe
Substrate
Column diameter (mm) 0.320.320.320.320.31
Phase thickness (μm)  0.51.0.250.5
Tstart (C) 60.60.60.50.50.
Tend (C) 220.250.250.250.250.
Heat rate (K/min) 4.4.4.8.4.
Initial hold (min) 5.5.5.
Final hold (min) 30.20.20.
I 942.983.952.902.914.
ReferenceMahadevan and Farmer, 2006Bredie, Mottram, et al., 2002Madruga and Mottram, 1998Misharina, Golovnya, et al., 1994Misharina, Golovnya, et al., 1992
Comment MSDC-RI MSDC-RI MSDC-RI MSDC-RI MSDC-RI
Column type CapillaryCapillary
Active phase DB-1DB-1
Column length (m) 60.60.
Carrier gas HeHe
Substrate
Column diameter (mm) 0.250.25
Phase thickness (μm) 0.250.25
Tstart (C) 40.40.
Tend (C) 220.220.
Heat rate (K/min) 2.2.
Initial hold (min)
Final hold (min) 10.10.
I 913.906.
ReferenceZhang and Ho, 1991Zhang and Ho, 1989
Comment MSDC-RI MSDC-RI

Normal alkane RI, non-polar column, custom temperature program

Data compiled by: NIST Mass Spectrometry Data Center, William E. Wallace, director

Column type CapillaryCapillary
Active phase Polydimethyl siloxaneMethyl Silicone
Column length (m)
Carrier gas
Substrate
Column diameter (mm)
Phase thickness (μm)
Program 40 0C 20 0C/min -> 60 0C (5 min) 4 0C/min -> 250 0Cnot specified
I 959.914.
ReferenceXu, He, et al., 2010Misharina, 1995
Comment MSDC-RI MSDC-RI

References

Kiss, Csoka, et al., 2011
Kiss, M.; Csoka, M.; Gyorfi, J.; Korany, K., Comparison of the fragrance constituents of Tuber aestivium and Tuber Brumale gathered in Hungary, J. Appl. Botany Food Quality, 2011, 84, 102-110. [all data]

Kumazawa and Masuda, 2002
Kumazawa, K.; Masuda, H., Identification of potent odorants in different green tea varieties using flavor dilution technique, J. Agric. Food Chem., 2002, 50, 20, 5660-5663, https://doi.org/10.1021/jf020498j . [all data]

Sanz, Maeztu, et al., 2002
Sanz, C.; Maeztu, L.; Zapelena, M.J.; Bello, J.; Cid, C., Profiles of volatile compounds and sensory analysis of three blends of coffee: influence of different proportions of Arabica and Robusta and influence of roasting coffee with sugar, J. Sci. Food Agric., 2002, 82, 8, 840-847, https://doi.org/10.1002/jsfa.1110 . [all data]

Kumazawa and Masuda, 2001
Kumazawa, K.; Masuda, H., Change in the flavor of black tea drink during heat processing, J. Agric. Food Chem., 2001, 49, 7, 3304-3309, https://doi.org/10.1021/jf001323h . [all data]

Guntert, Brüning, et al., 1990
Guntert, M.; Brüning, J.; Emberger, R.; Köpsel, Ml; Kuhn, W.; Thielmann, T.; Werkhoff, P., Identification and formation of some selected sulfur-containing flavor compounds in various meat model systems, J. Agric. Food Chem., 1990, 38, 11, 2027-2041, https://doi.org/10.1021/jf00101a007 . [all data]