Nobelium

Gas phase ion energetics data

Data evaluated as indicated in comments:
L - Sharon G. Lias

Data compiled as indicated in comments:
LL - Sharon G. Lias and Joel F. Liebman
LLK - Sharon G. Lias, Rhoda D. Levin, and Sherif A. Kafafi

Quantity Value Units Method Reference Comment
IE (evaluated)6.65 ± 0.07eVN/AN/AL

Ionization energy determinations

IE (eV) Method Reference Comment
6.65EVALLide, 1992LL
6.65 ± 0.07EVALSugar, 1974LLK
6.84 ± 0.12SSugar, 1973LLK

References

Lide, 1992
Lide, D.R. (Editor), Ionization potentials of atoms and atomic ions in Handbook of Chem. and Phys., 1992, 10-211. [all data]

Sugar, 1974
Sugar, J., Revised ionization energies of the neutral actinides, J. Chem. Phys., 1974, 60, 4103. [all data]

Sugar, 1973
Sugar, J., Ionization energies of the neutral actinides, J. Chem. Phys., 1973, 59, 788. [all data]