1-ethoxy-2-(2-methoxyethoxy)ethane

Phase change data

Data compiled by: Thermodynamics Research Center, NIST Boulder Laboratories, Chris Muzny director

Quantity Value Units Method Reference Comment
Tfus201.5KN/AAnonymous, 1954Uncertainty assigned by TRC = 0.6 K

In addition to the Thermodynamics Research Center (TRC) data available from this site, much more physical and chemical property data is available from the following TRC products:

References

Anonymous, 1954
Anonymous, R., , Am. Pet. Inst. Res. Proj. 45, Tech. Rep. 13, Ohio State Univ., 1954. [all data]