phosphorus pentachloride
- Formula: Cl5P
- Molecular weight: 208.239
- IUPAC Standard InChIKey: UHZYTMXLRWXGPK-UHFFFAOYSA-N
- CAS Registry Number: 10026-13-8
- Chemical structure:

Phase change data

Data compiled as indicated in comments:
AC - William E. Acree, Jr., James S. Chickos
Quantity | Value | Units | Method | Reference | Comment |
---|---|---|---|---|---|
ΔsubH° | 71.1 ± 5.0 | kJ/mol | N/A | Polyachenok and Polyachenok, 1973 | AC |
Antoine Equation Parameters
log10(P) = A − (B / (T + C))
P = vapor pressure (bar)
T = temperature (K)
View plot Requires a JavaScript / HTML 5 canvas capable browser.
Temperature (K) | A | B | C | Reference | Comment |
---|---|---|---|---|---|
328.7 to 435. | 4.68217 | 1300.484 | -157.173 | Stull, 1947 | Coefficents calculated by NIST from author's data. |
Enthalpy of sublimation
ΔsubH (kJ/mol) | Temperature (K) | Reference | Comment |
---|---|---|---|
67.4 ± 2.3 | 390. | Polyachenok and Polyachenok, 1973 | AC |

Gas phase thermochemistry data

Quantity | Value | Units | Method | Reference | Comment |
---|---|---|---|---|---|
S°gas,1 bar | 87.048 | cal/mol*K | Review | Chase, 1998 | Data last reviewed in September, 1962 |
Gas Phase Heat Capacity (Shomate Equation)
Cp° = A + B*t + C*t2 + D*t3 +
E/t2
H° − H°298.15= A*t + B*t2/2 +
C*t3/3 + D*t4/4 − E/t + F − H
S° = A*ln(t) + B*t + C*t2/2 + D*t3/3 −
E/(2*t2) + G
Cp = heat capacity (cal/mol*K)
H° = standard enthalpy (kcal/mol)
S° = standard entropy (cal/mol*K)
t = temperature (K) / 1000.
View plot Requires a JavaScript / HTML 5 canvas capable browser.
Temperature (K) | 298. to 6000. |
---|---|
A | 31.28439 |
B | 0.434891 |
C | -0.117690 |
D | 0.010035 |
E | -0.421901 |
F | -96.84661 |
G | 122.4100 |
H | -86.08609 |
Reference | Chase, 1998 |
Comment | Data last reviewed in September, 1962 |

Gas phase ion energetics data

Data compiled as indicated in comments:
LBLHLM - Sharon G. Lias, John E. Bartmess, Joel F. Liebman, John L. Holmes, Rhoda D. Levin, and W. Gary Mallard
LLK - Sharon G. Lias, Rhoda D. Levin, and Sherif A. Kafafi

Ionization energy determinations

IE (eV) Method Reference Comment
10.2PEElbel, Runger, et al., 1986LBLHLM
10.88PECox, Evans, et al., 1972Vertical value; LLK
10.7PEBetteridge, Thompson, et al., 1972Vertical value; LLK

Vibrational and/or electronic energy levels

Data compiled by: Takehiko Shimanouchi

Symmetry:   D3h     Symmetry Number σ = 6

 Sym.   No   Approximate   Selected Freq.  Infrared   Raman   Comments
 Species   type of mode   Value   Rating   Value  Phase  Value  Phase

a1' 1 PCl3 s-str 395  D 395 VS p solid solid solid solid
a1' 2 PCl2 s-str 370  D 370 VW dp solid solid solid solid
a2 3 PCl2 a-str 465  C 465 VS gas 441 VW dp solid solid solid solid
a2 4 PCl3 op-deform 299  D 299 S solid solid 301 solid solid solid solid
e' 5 PCl3 d-str 592  C 592 VS gas 581 W p solid solid solid solid
e' 6 PCl3 d-deform 273  D 273 S solid solid 281 W dp solid solid solid solid
e' 7 PCl bend 100  C 100 W gas 100 M dp solid solid solid solid
e 8 PCl bend 261  D 261 W dp solid solid solid solid

Source: Shimanouchi, 1972

References

Polyachenok and Polyachenok, 1973
Polyachenok, L.D.; Polyachenok, O.G.,
Zh. Fiz. Khim., 1973, 47, 498. [all data]
Stull, 1947
Stull, Daniel R.,
Vapor Pressure of Pure Substances. Organic and Inorganic Compounds,
Ind. Eng. Chem., 1947, 39, 4, 517-540, https://doi.org/10.1021/ie50448a022
. [all data]