indium trichloride

Gas phase ion energetics data

Data compiled as indicated in comments:
LL - Sharon G. Lias and Joel F. Liebman
LLK - Sharon G. Lias, Rhoda D. Levin, and Sherif A. Kafafi

Ionization energy determinations

IE (eV) Method Reference Comment
13.3 ± 0.3EIDefoort, Chatillon, et al., 1988LL
11.45PEDehmer, Berkowitz, et al., 1974LLK
~11.4PEBarker, Lappert, et al., 1975Vertical value; LLK

References

Defoort, Chatillon, et al., 1988
Defoort, F.; Chatillon, C.; Bernard, C., Mass-spectrometric study of (indium + chlorine) (g) Enthalpies of formation of InCl(g), and In2Cl6(g), J. Chem. Thermodyn., 1988, 20, 1443. [all data]

Dehmer, Berkowitz, et al., 1974
Dehmer, J.L.; Berkowitz, J.; Cusachs, L.C.; Aldrich, H.S., Photoelectron spectroscopy of high temperature vapors. V. HeI spectra of GaX3 and InX3 (X = Cl, Br, I), J. Chem. Phys., 1974, 61, 594. [all data]

Barker, Lappert, et al., 1975
Barker, G.K.; Lappert, M.F.; Pedley, J.B.; Sharp, G.J.; Westwood, N.P.C., Bonding studies of boron and the group 3-5 elements. Part XV. He(I) photoelectron spectra of monomeric group 3 tri-halide, trimethyl, and mixed halogenomethyl species, J. Chem. Soc. Dalton Trans., 1975, 1765. [all data]