europium (III) chloride, anhydrous

Ion clustering data

Data compiled by: John E. Bartmess

Clustering reactions

Cl4Eu- + Cl3Eu = (Cl4Eu- • Cl3Eu)

By formula: Cl4Eu- + Cl3Eu = (Cl4Eu- • Cl3Eu)

Quantity Value Units Method Reference Comment
Δr477. ± 46.kJ/molTherKudin, Burdukovskaya, et al., 1993gas phase

Reaction thermochemistry data

Data compiled by: John E. Bartmess

Individual Reactions

Cl4Eu- + Cl3Eu = (Cl4Eu- • Cl3Eu)

By formula: Cl4Eu- + Cl3Eu = (Cl4Eu- • Cl3Eu)

Quantity Value Units Method Reference Comment
Δr114. ± 11.kcal/molTherKudin, Burdukovskaya, et al., 1993gas phase

References

Kudin, Burdukovskaya, et al., 1993
Kudin, L.S.; Burdukovskaya, G.G.; Butman, M.F.; Krasnov, K.S., Mass-Spectrometric Determination of EuCl2-, EuCl3-, EuCl4- and Eu2Cl7- Gaseous Ion Formation Enthalpies, Zh. Fiz. Khim. SSSR, 1993, 67, 645. [all data]