neodymium trichloride
- Formula: Cl3Nd
- Molecular weight: 250.601
- CAS Registry Number: 10024-93-8

Reaction thermochemistry data

Data compiled by: John E. Bartmess
Individual Reactions
By formula: Cl4Nd- + 2Cl3Nd = Cl10Nd3-
Quantity | Value | Units | Method | Reference | Comment |
---|---|---|---|---|---|
ΔrH° | 423. ± 46. | kJ/mol | TDAs | Kudin, Pogrebnoi, et al., 1993 | gas phase |

References

Kudin, Pogrebnoi, et al., 1993
Kudin, L.S.; Pogrebnoi, A.M.; Burdukovskaya, G.G.,
Mass-Spectrometric Study of Saturated Vapor Composition over Neodymium Chlorides .2. Ion-Molecular Equilibrium and Enthalpies of Formation of Formation of Positive and Negative Ions.,
Zh. Fiz. Khim. SSSR, 1993, 67, 908. [all data]