Undecane, 3-methyl-

Phase change data

Data compiled as indicated in comments:
TRC - Thermodynamics Research Center, NIST Boulder Laboratories, Chris Muzny director
AC - William E. Acree, Jr., James S. Chickos

Quantity Value Units Method Reference Comment
Tfus218.5KN/APetrov, Sergienko, et al., 1959Uncertainty assigned by TRC = 2. K; TRC
Tfus215.2KN/ATerres, Gebert, et al., 1954Uncertainty assigned by TRC = 5. K; listed as "solidification point"; TRC

Enthalpy of vaporization

ΔvapH (kJ/mol) Temperature (K) Method Reference Comment
48.8372.AStephenson and Malanowski, 1987Based on data from 357. - 485. K.; AC

In addition to the Thermodynamics Research Center (TRC) data available from this site, much more physical and chemical property data is available from the following TRC products:

Kovats' RI, non-polar column, isothermal

View large format table.

Column type Active phase Temperature (C) I Reference Comment
CapillarySqualane100.1170.Heinzen, Soares, et al., 1999
CapillaryOV-160.1173.Nijs and Jacobs, 1981He; Column length: 150. m; Column diameter: 0.50 mm
PackedSE-30120.1165.Mitra, Mohan, et al., 1974N2, Chrom W; Column length: 6.1 m
PackedSE-30130.1168.Mitra, Mohan, et al., 1974N2, Chrom W; Column length: 6.1 m
PackedSE-30140.1173.Mitra, Mohan, et al., 1974N2, Chrom W; Column length: 6.1 m
CapillarySqualane100.1173.Mitra, Mohan, et al., 1974, 2H2; Column length: 50. m; Column diameter: 0.2 mm
CapillaryApiezon L100.1168.Rappoport and Gäumann, 1973
CapillarySqualane100.1169.6Schomburg and Dielmann, 1973Column length: 100. m; Column diameter: 0.25 mm
CapillaryDC-200100.1170.Schomburg and Henneberg, 1968He; Column length: 100. m; Column diameter: 0.25 mm

Kovats' RI, non-polar column, temperature ramp

View large format table.

Column type Active phase I Reference Comment
CapillarySE-541171.Rembold, Wallner, et al., 198930. m/0.25 mm/0.25 μm, He, 0. C @ 12. min, 12. K/min; Tend: 250. C

Van Den Dool and Kratz RI, non-polar column, temperature ramp

View large format table.

Column type Active phase I Reference Comment
CapillaryPetrocol DH1169.White, Hackett, et al., 1992100. m/0.25 mm/0.5 μm, He, 1. K/min; Tstart: 30. C; Tend: 220. C
CapillaryCross-Linked Methylsilicone1172.Khorasheh, Gray, et al., 19895. K/min; Tstart: 40. C; Tend: 300. C
CapillaryOV-1011171.Hayes and Pitzer, 1981108. m/0.25 mm/0.2 μm, 1. K/min; Tstart: 35. C; Tend: 200. C

Van Den Dool and Kratz RI, non-polar column, custom temperature program

View large format table.

Column type Active phase I Reference Comment
CapillaryDB-51169.Zaikin and Borisov, 2002He; Column length: 30. m; Column diameter: 0.25 mm; Program: 30C => 5K/min=120C => 10C/min => 270C

Normal alkane RI, non-polar column, isothermal

View large format table.

Column type Active phase Temperature (C) I Reference Comment
CapillaryApiezon L40. - 190.1173.Mann, Mühlstädt, et al., 1967Column length: 2. m

Normal alkane RI, non-polar column, temperature ramp

View large format table.

Column type Active phase I Reference Comment
CapillaryHP-5 MS1171.Kotowska, Zalikowski, et al., 201230. m/0.25 mm/0.25 μm, Helium, 35. C @ 5. min, 3. K/min, 300. C @ 15. min
CapillaryRTX-11170.Dib, Djabou, et al., 201060. m/0.22 mm/0.25 μm, Helium, 2. K/min, 230. C @ 30. min; Tstart: 60. C
CapillaryPONA1173.Zhang, Ding, et al., 200950. m/0.20 mm/0.50 μm, Nitrogen, 35. C @ 15. min, 2. K/min, 200. C @ 10. min
CapillaryOV-11172.2Krkosova, Kubinec, et al., 2007100. m/0.32 mm/0.25 μm, Helium, 5. K/min, 310. C @ 5. min; Tstart: 30. C
CapillaryDB-11172.Katritzky, Chen, et al., 200030. m/0.32 mm/0.25 μm; Tstart: 60. C; Tend: 320. C

Normal alkane RI, non-polar column, custom temperature program

View large format table.

Column type Active phase I Reference Comment
CapillaryHP-5 MS1171.Kotowska, Zalikowski, et al., 201230. m/0.25 mm/0.25 μm, Helium; Program: not specified
CapillaryPolydimethyl siloxane with 5 % Ph groups1169.Robinson, Adams, et al., 2012Program: not specified
CapillaryPolydimethyl siloxane with 5 % Ph groups1170.Robinson, Adams, et al., 2012Program: not specified
CapillaryRTX-11165.Dib, Djabou, et al., 201060. m/0.22 mm/0.25 μm, Helium; Program: not specified
CapillaryPolydimethyl siloxane1172.Junkes, Castanho, et al., 2003Program: not specified
CapillarySqualane1170.Petrov, 1984Program: not specified
CapillaryApiezon L1170.Shlyakhov, 1984Program: not specified

References

Petrov, Sergienko, et al., 1959
Petrov, A.A.; Sergienko, S.R.; Nechitailo, N.A.; Tsedilina, A.L., Izv. Akad. Nauk SSSR, 1959, 1959, 1091-7. [all data]

Terres, Gebert, et al., 1954
Terres, E.; Gebert, F.; Fischer, D.; Modak, G., Brennst.-Chem., 1954, 35, 263-9. [all data]

Stephenson and Malanowski, 1987
Stephenson, Richard M.; Malanowski, Stanislaw, Handbook of the Thermodynamics of Organic Compounds, 1987, https://doi.org/10.1007/978-94-009-3173-2 . [all data]

Heinzen, Soares, et al., 1999
Heinzen, V.E.F.; Soares, M.F.; Yunes, R.A., Semi-empirical topological method for the prediction of the chromatographic retention of cis- and trans-alkene isomers and alkanes, J. Chromatogr. A, 1999, 849, 2, 495-506, https://doi.org/10.1016/S0021-9673(99)00530-0 . [all data]

Nijs and Jacobs, 1981
Nijs, H.H.; Jacobs, P.A., On-Line Single Run Analysis of Effluents from a Fischer-Tropsch Reactor, J. Chromatogr. Sci., 1981, 19, 1, 40-45, https://doi.org/10.1093/chromsci/19.1.40 . [all data]

Mitra, Mohan, et al., 1974
Mitra, G.D.; Mohan, G.; Sinha, A., Advances in the utilization of the retention index system for characterizing hydrocarbons in complex mixtures by gas chromatography, J. Chromatogr., 1974, 99, 215-230, https://doi.org/10.1016/S0021-9673(00)90857-4 . [all data]

Mitra, Mohan, et al., 1974, 2
Mitra, G.D.; Mohan, G.; Sinha, A., Gas chromatographic analysis of complex hydrocarbon mixtures, J. Chromatogr. A, 1974, 91, 633-648, https://doi.org/10.1016/S0021-9673(01)97944-0 . [all data]

Rappoport and Gäumann, 1973
Rappoport, S.; Gäumann, T., 114. L'indice de rétention des alcanes isomères en chromatographie en phase gazeuse, Helv. Chim. Acta, 1973, 56, 3, 1145-1158, https://doi.org/10.1002/hlca.19730560338 . [all data]

Schomburg and Dielmann, 1973
Schomburg, G.; Dielmann, G., Identification by means of retention parameters, J. Chromatogr. Sci., 1973, 11, 3, 151-159, https://doi.org/10.1093/chromsci/11.3.151 . [all data]

Schomburg and Henneberg, 1968
Schomburg, G.; Henneberg, D., Analyse von i-Paraffingemischen aus ?methylene insertion?-bzw. ?methylene-d2 insertion?-Reaktionen mit einer Kombination Capillar-Gas-Chromatographie/Massenspectrometrie, Anal. Chem., 1968, 236, 1, 279-294, https://doi.org/10.1007/BF00503281 . [all data]

Rembold, Wallner, et al., 1989
Rembold, H.; Wallner, P.; Nitz, S.; Kollmannsberger, H.; Drawert, F., Volatile components of chickpea (Cicer arietinum L.) seed, J. Agric. Food Chem., 1989, 37, 3, 659-662, https://doi.org/10.1021/jf00087a018 . [all data]

White, Hackett, et al., 1992
White, C.M.; Hackett, J.; Anderson, R.R.; Kail, S.; Spock, P.S., Linear temperature programmed retention indices of gasoline range hydrocarbons and chlorinated hydrocarbons on cross-linked polydimethylsiloxane, J. Hi. Res. Chromatogr., 1992, 15, 2, 105-120, https://doi.org/10.1002/jhrc.1240150211 . [all data]

Khorasheh, Gray, et al., 1989
Khorasheh, F.; Gray, M.R.; Selucky, M.L., Correlation for Kováts retention index of C9-C26 monoalkyl and polymethyl alkanes and alkenes, J. Chromatogr., 1989, 481, 1-16, https://doi.org/10.1016/S0021-9673(01)96747-0 . [all data]

Hayes and Pitzer, 1981
Hayes, P.C., Jr.; Pitzer, E.W., Kovats indices as a tool in characterizing hydrocarbon fuels in temperature programmed glass capillary gas chromatography. Part 1. Qualitative identification, Inhouse rpt. for Air Force Wright Aeronautical Labs., Air Force Wright Aeronautical Labs., Wright-Patterson AFB, Ohio, 1981, 75. [all data]

Zaikin and Borisov, 2002
Zaikin, V.G.; Borisov, R.S., Chromatographic-mass spectrometric analysis of Fishcer-Tropsch synthesis products, J. Anal. Chem. USSR (Engl. Transl.), 2002, 57, 6, 544-551. [all data]

Mann, Mühlstädt, et al., 1967
Mann, G.; Mühlstädt, M.; Braband, J.; Döring, E., Konformation und physikalische daten von alkanen und cyclanen. II. Einfach und zweifach verzweigte alkane, Tetrahedron, 1967, 23, 8, 3393-3401, https://doi.org/10.1016/S0040-4020(01)92305-1 . [all data]

Kotowska, Zalikowski, et al., 2012
Kotowska, U.; Zalikowski, M.; Isidorov, V.A., HS-SPME/GC-MS analysis of volatile and semi-volatile organic compounds emitted from municipal sewage sludge, Environ. Monit. Asses., 2012, 184, 5, 2893-2907, https://doi.org/10.1007/s10661-011-2158-8 . [all data]

Dib, Djabou, et al., 2010
Dib, M.ElA.; Djabou, N.; Desjobert, L.-M.; Allali, H.; Tabti, B.; Muselli, A.; Costa, J., Characterization of volatile compounds of Daucus crinitus Desf. headspace solid phase microextraction as alternative technique to hydrodistillation, Chem, Centr. J., 2010, 4, 16, 1-15. [all data]

Zhang, Ding, et al., 2009
Zhang, X.; Ding, L.; Sun, Z.; Song, L.; Sun, T., Study on quantitative structure-retention relationships for hydrocarbons in FCC gasoline, Chromatographia, 2009, 70, 3/4, 511-518, https://doi.org/10.1365/s10337-009-1174-0 . [all data]

Krkosova, Kubinec, et al., 2007
Krkosova, Z.; Kubinec, R.; Addova, G.; Jurdakova, H.; Blasko, J.; Ostrovsky, I.; Sojak, L., Gas chromatographic - mass spectrometric characterization of monomethylalkanes from fuel diesel, Petroleum Coal, 2007, 49, 3, 51-62. [all data]

Katritzky, Chen, et al., 2000
Katritzky, A.R.; Chen, K.; Maran, U.; Carlson, D.A., QSPR Correlation and predictions of GC retention indexes for methyl-branched hydrocarbons produced by insects, Anal. Chem., 2000, 72, 1, 101-109, https://doi.org/10.1021/ac990800w . [all data]

Robinson, Adams, et al., 2012
Robinson, A.L.; Adams, D.O.; Boss, P.K.; Heymann, H.; Solomon, P.S.; Trengove, R.D., Influence of geographic origine on the sensory characteristics and wine composition of Vitus viniferas cv. Cabernet Sauvignon wines from Australia (Supplemental data), Am. J. Enol. Vitic., 2012, 64, 4, 467-476, https://doi.org/10.5344/ajev.2012.12023 . [all data]

Junkes, Castanho, et al., 2003
Junkes, B.S.; Castanho, R.D.M.; Amboni, C.; Yunes, R.A.; Heinzen, V.E.F., Semiempirical Topological Index: A Novel Molecular Descriptor for Quantitative Structure-Retention Relationship Studies, Internet Electronic Journal of Molecular Design, 2003, 2, 1, 33-49. [all data]

Petrov, 1984
Petrov, A.A., Hydrocarbons of petroleum, Nauka (publishing house), Moscow, 1984, 263. [all data]

Shlyakhov, 1984
Shlyakhov, A.F., Gas chromatography in organic geochemistry, Nedra, Moscow, 1984, 221. [all data]