nitryl fluoride

Gas phase thermochemistry data

Quantity Value Units Method Reference Comment
Δfgas-108.78kJ/molReviewChase, 1998Data last reviewed in December, 1965
Quantity Value Units Method Reference Comment
gas,1 bar260.25J/mol*KReviewChase, 1998Data last reviewed in December, 1965

Gas Phase Heat Capacity (Shomate Equation)

Cp° = A + B*t + C*t2 + D*t3 + E/t2
H° − H°298.15= A*t + B*t2/2 + C*t3/3 + D*t4/4 − E/t + F − H
S° = A*ln(t) + B*t + C*t2/2 + D*t3/3 − E/(2*t2) + G
    Cp = heat capacity (J/mol*K)
    H° = standard enthalpy (kJ/mol)
    S° = standard entropy (J/mol*K)
    t = temperature (K) / 1000.

View plot Requires a JavaScript / HTML 5 canvas capable browser.

View table.

Temperature (K) 298. - 1100.1100. - 6000.
A 25.7849081.12650
B 112.93751.116488
C -89.46061-0.224392
D 26.172840.015461
E -0.208291-6.925650
F -121.4527-150.8014
G 260.3523332.9213
H -108.7840-108.7840
ReferenceChase, 1998Chase, 1998
Comment Data last reviewed in December, 1965 Data last reviewed in December, 1965

Phase change data

Data compiled by: Thermodynamics Research Center, NIST Boulder Laboratories, Chris Muzny director

Quantity Value Units Method Reference Comment
Tboil200.8KN/AStreng, 1971Uncertainty assigned by TRC = 0.3 K
Quantity Value Units Method Reference Comment
Tfus107.2KN/AStreng, 1971Uncertainty assigned by TRC = 0.3 K

In addition to the Thermodynamics Research Center (TRC) data available from this site, much more physical and chemical property data is available from the following TRC products:

Gas phase ion energetics data

Data compiled by: Sharon G. Lias, Rhoda D. Levin, and Sherif A. Kafafi

Ionization energy determinations

IE (eV) Method Reference
13.09PEFrost, Lee, et al., 1975

References

Chase, 1998
Chase, M.W., Jr., NIST-JANAF Themochemical Tables, Fourth Edition, J. Phys. Chem. Ref. Data, Monograph 9, 1998, 1-1951. [all data]