Nitric acid, pentyl ester

Normal alkane RI, polar column, custom temperature program

Data compiled by: NIST Mass Spectrometry Data Center, William E. Wallace, director

Column type Capillary
Active phase DB-Wax
Column length (m) 60.
Carrier gas
Substrate
Column diameter (mm) 0.25
Phase thickness (μm)
Program not specified
I 1220.
ReferenceButtery and Takeoka, 2004
Comment MSDC-RI

References

Buttery and Takeoka, 2004
Buttery, R.G.; Takeoka, G.R., Some unusual minor volatile components of tomato, J. Agric. Food Chem., 2004, 52, 20, 6246-6266, https://doi.org/10.1021/jf040176a . [all data]