1,4-Benzenedicarbonyl dichloride

Condensed phase thermochemistry data

Data compiled as indicated in comments:
ALS - Hussein Y. Afeefy, Joel F. Liebman, and Stephen E. Stein
DH - Eugene S. Domalski and Elizabeth D. Hearing

Quantity Value Units Method Reference Comment
Δfsolid-81.00 ± 0.60kcal/molCcbKaryakin, Rabinovich, et al., 1978ALS
Δfsolid-91.7kcal/molCcbSapozhnikov, Mochalov, et al., 1973ALS
Quantity Value Units Method Reference Comment
Δcsolid-808.03 ± 0.60kcal/molCcbKaryakin, Rabinovich, et al., 1978ALS
Δcsolid-808.4 ± 0.8kcal/molCcbSapozhnikov, Mochalov, et al., 1973ALS
Quantity Value Units Method Reference Comment
solid,1 bar54.04cal/mol*KN/ASapozhnikov and Mochalov, 1973DH

Constant pressure heat capacity of solid

Cp,solid (cal/mol*K) Temperature (K) Reference Comment
49.69300.Sapozhnikov and Mochalov, 1973T = 20 to 300 K.; DH

References

Karyakin, Rabinovich, et al., 1978
Karyakin, N.V.; Rabinovich, I.B.; Sokolov, L.B., Thermodynamics of the synthesis of isomeric poly(phenylenephthalamides), Vysokomol. Soedin. Ser. B, 1978, 20, 662-666. [all data]

Sapozhnikov, Mochalov, et al., 1973
Sapozhnikov, V.N.; Mochalov, A.N.; Karyakin, N.V.; Kunyavskaya, S.G.; Chernova, V.I.; Rabinovich, I.B., Low-temperature heat capacity and thermodynamic properties of some acid dichlorides, Tr. Khim. Khim. Tekhnol., 1973, 55-57. [all data]

Sapozhnikov and Mochalov, 1973
Sapozhnikov, V.N.; Mochalov, A.N., Karyakin, N.V. Kunyavskaya, S.G., Chernova, V.I., and Rabinovich, I.B., Low-temperature heat capacity and thermodynamic properties of some acid dichlorides, 1973, Tr. [all data]