1,2-Pentadiene, 1-bromo-4,4-dimethyl-

Gas phase ion energetics data

Data compiled by: Sharon G. Lias, John E. Bartmess, Joel F. Liebman, John L. Holmes, Rhoda D. Levin, and W. Gary Mallard

Ionization energy determinations

IE (eV) Method Reference Comment
8.9PEElsevier, Vermeer, et al., 1985
9.10PEElsevier, Vermeer, et al., 1985Vertical value

References

Elsevier, Vermeer, et al., 1985
Elsevier, C.J.; Vermeer, P.; Gedanken, A.; Runge, W., Excited states of the allene chromophore: Photoelectron, circular dichroism, and absorption spectroscopy of alkyl- and halogenoallenes, J. Am. Chem. Soc., 1985, 107, 2537. [all data]