Sn(CHCH2)3(Cl)

Reaction thermochemistry data

Data compiled by: José A. Martinho Simões

Individual Reactions

3Stannane, tetraethenyl- (l) + Tin(IV) chloride (l) = 4C6H9ClSn (l)

By formula: 3C8H12Sn (l) + Cl4Sn (l) = 4C6H9ClSn (l)

Quantity Value Units Method Reference Comment
Δr-111. ± 13.kJ/molRSCNash, Skinner, et al., 1965

References

Nash, Skinner, et al., 1965
Nash, G.A.; Skinner, H.A.; Stack, W.F., Trans. Faraday Soc., 1965, 61, 640. [all data]