4-Acetylanisole

Phase change data

Data compiled as indicated in comments:
BS - Robert L. Brown and Stephen E. Stein
TRC - Thermodynamics Research Center, NIST Boulder Laboratories, Chris Muzny director
AC - William E. Acree, Jr., James S. Chickos
ALS - Hussein Y. Afeefy, Joel F. Liebman, and Stephen E. Stein

Quantity Value Units Method Reference Comment
Tboil531.2KN/AWeast and Grasselli, 1989BS
Quantity Value Units Method Reference Comment
Tfus312.KN/AVowinkel, 1966Uncertainty assigned by TRC = 3. K; TRC
Tfus311.65KN/ASerpinskii, Voitkevich, et al., 1958Uncertainty assigned by TRC = 1.5 K; TRC
Tfus311.4KN/ASerpinskii, Voitkevich, et al., 1954Uncertainty assigned by TRC = 0.7 K; TRC
Tfus311.15KN/AAtkins, 1915Uncertainty assigned by TRC = 1. K; TRC

Reduced pressure boiling point

Tboil (K) Pressure (bar) Reference Comment
426.20.035Aldrich Chemical Company Inc., 1990BS
411.70.020Weast and Grasselli, 1989BS

Enthalpy of vaporization

ΔvapH (kJ/mol) Temperature (K) Method Reference Comment
66.5322.A,MEStephenson and Malanowski, 1987Based on data from 311. - 334. K. See also Serpinskii, Voitkevich, et al., 1954, 2.; AC

Enthalpy of sublimation

ΔsubH (kJ/mol) Temperature (K) Method Reference Comment
77.7 ± 0.2311.4VAihara, 1959crystal phase; ALS
77.7276. - 300.VAihara, 1959, 2AC
93.7308.ASerpinskii, Voitkevich, et al., 1954, 2Based on data from 283. - 333. K. See also Jones, 1960 and Stephenson and Malanowski, 1987.; AC

In addition to the Thermodynamics Research Center (TRC) data available from this site, much more physical and chemical property data is available from the following TRC products:

Condensed phase thermochemistry data

Data compiled by: Hussein Y. Afeefy, Joel F. Liebman, and Stephen E. Stein

Quantity Value Units Method Reference Comment
Δcliquid-4669.8kJ/molCcbSeno, Tsuchiya, et al., 1975Corresponding Δfliquid = -301. kJ/mol (simple calculation by NIST; no Washburn corrections)

Normal alkane RI, non-polar column, isothermal

Data compiled by: NIST Mass Spectrometry Data Center, William E. Wallace, director

Column type Capillary
Active phase DB-5
Column length (m)
Carrier gas
Substrate
Column diameter (mm)
Phase thickness (μm)
Temperature (C) 25.
I 1348.
ReferenceHemmateenejad, Jawadnia, et al., 2007
Comment MSDC-RI

References

Weast and Grasselli, 1989
CRC Handbook of Data on Organic Compounds, 2nd Editon, Weast,R.C and Grasselli, J.G., ed(s)., CRC Press, Inc., Boca Raton, FL, 1989, 1. [all data]

Vowinkel, 1966
Vowinkel, E., Preparation of Aryl Alky8 Ethers by Means of O-Alkyl-N,N'-dicyclohexyl- isoureas, Chem. Ber., 1966, 99, 1479-84. [all data]

Serpinskii, Voitkevich, et al., 1958
Serpinskii, V.V.; Voitkevich, S.A.; Lyuboshits, N.Yu., Trudy Vsesoyuz. Nauch.-Issledovatel. Inst. Sintet. I. Natural. Dushistykh Veshchestv, 1958, 4, 125. [all data]

Serpinskii, Voitkevich, et al., 1954
Serpinskii, V.V.; Voitkevich, S.A.; Lyuboshits, N.Y., Zh. Fiz. Khim., 1954, 28, 1969. [all data]

Atkins, 1915
Atkins, W.R.G., Spectrochemical Experiments, Justus Liebigs Ann. Chem., 1915, 408, 212. [all data]

Aldrich Chemical Company Inc., 1990
Aldrich Chemical Company Inc., Catalog Handbook of Fine Chemicals, Aldrich Chemical Company, Inc., Milwaukee WI, 1990, 1. [all data]

Stephenson and Malanowski, 1987
Stephenson, Richard M.; Malanowski, Stanislaw, Handbook of the Thermodynamics of Organic Compounds, 1987, https://doi.org/10.1007/978-94-009-3173-2 . [all data]

Serpinskii, Voitkevich, et al., 1954, 2
Serpinskii, V.V.; Voitkevich, S.A.; Lyuboshits, N.Y., Zh. Fiz. Khim., 1954, 28, 810. [all data]

Aihara, 1959
Aihara, A., Estimation of the energy of hydrogen bonds formed in crystals. I. Sublimation pressures of some organic molecular crystals and the additivity of lattice energy, Bull. Chem. Soc. Jpn., 1959, 32, 1242. [all data]

Aihara, 1959, 2
Aihara, Ariyuki, Estimation of the Energy of Hydrogen Bonds Formed in Crystals. I. Sublimation Pressures of Some Organic Molecular Crystals and the Additivity of Lattice Energy, Bull. Chem. Soc. Jpn., 1959, 32, 11, 1242-1248, https://doi.org/10.1246/bcsj.32.1242 . [all data]

Jones, 1960
Jones, A.H., Sublimation Pressure Data for Organic Compounds., J. Chem. Eng. Data, 1960, 5, 2, 196-200, https://doi.org/10.1021/je60006a019 . [all data]