H2O..F anion

Gas phase thermochemistry data

Data compiled by: John E. Bartmess

Quantity Value Units Method Reference Comment
Δfgas-605.3 ± 2.1kJ/molTherWeis, Kemper, et al., 1999

References

Weis, Kemper, et al., 1999
Weis, P.; Kemper, P.R.; Bowers, M.T.; Xantheas, S.S., A new determination of the fluoride ion-water bond energy, J. Am. Chem. Soc., 1999, 121, 14, 3531-3532, https://doi.org/10.1021/ja9842161 . [all data]