CrO radical anion

Gas phase thermochemistry data

Data compiled by: John E. Bartmess

Quantity Value Units Method Reference Comment
Δfgas23.8 ± 7.0kcal/molR-EAWenthold, Gunion, et al., 1996
Δfgas44. ± 12.kcal/molEIAEFlesch, White, et al., 1969From CrO2F2

References

Wenthold, Gunion, et al., 1996
Wenthold, P.G.; Gunion, R.F.; Lineberger, W.C., Ultraviolet Negative-ion Photoelectron Spectroscopy of the Chromium Oxide Negative Ion, Chem. Phys. Lett., 1996, 258, 1-2, 101, https://doi.org/10.1016/0009-2614(96)00611-2 . [all data]

Flesch, White, et al., 1969
Flesch, G.D.; White, R.M.; Svec, H.J., The Positive and Negative Ion Mass Spectra of Chromyl Chloride and Chromyl Fluoride, Int. J. Mass Spectrom. Ion Phys., 1969, 3, 5, 239, https://doi.org/10.1016/0020-7381(69)80079-3 . [all data]