2,5-Cyclohexadiene-1,4-dione, 2,6-dichloro- anion

Gas phase thermochemistry data

Data compiled by: John E. Bartmess

Quantity Value Units Method Reference Comment
Δfgas-98.9 ± 3.2kcal/molR-EAHeinis, Chowdhury, et al., 1988ΔGea=-55.8 kcal/mol; ΔSea estimated = -3.5 eu

References

Heinis, Chowdhury, et al., 1988
Heinis, T.; Chowdhury, S.; Scott, S.L.; Kebarle, P., Electron Affinities of Benzo-, Naphtho-, and Anthraquinones Determined from Gas-Phase Equilibria Measurements, J. Am. Chem. Soc., 1988, 110, 2, 400, https://doi.org/10.1021/ja00210a015 . [all data]