MeOCH2 anion

Reaction thermochemistry data

Data compiled by: John E. Bartmess

Individual Reactions

C2H5O- + Hydrogen cation = Dimethyl ether

By formula: C2H5O- + H+ = C2H6O

Quantity Value Units Method Reference Comment
Δr1703. ± 8.4kJ/molBranDePuy, Bierbaum, et al., 1984gas phase
Quantity Value Units Method Reference Comment
Δr1666. ± 9.2kJ/molH-TSDePuy, Bierbaum, et al., 1984gas phase

Gas phase ion energetics data

Data compiled by: John E. Bartmess

Protonation reactions

C2H5O- + Hydrogen cation = Dimethyl ether

By formula: C2H5O- + H+ = C2H6O

Quantity Value Units Method Reference Comment
Δr407.0 ± 2.0kcal/molBranDePuy, Bierbaum, et al., 1984gas phase
Quantity Value Units Method Reference Comment
Δr398.2 ± 2.2kcal/molH-TSDePuy, Bierbaum, et al., 1984gas phase

References

DePuy, Bierbaum, et al., 1984
DePuy, C.H.; Bierbaum, V.M.; Damrauer, R., Relative Gas-Phase Acidities of the Alkanes, J. Am. Chem. Soc., 1984, 106, 4051. [all data]