BrCl2 anion

Gas phase thermochemistry data

Data compiled by: John E. Bartmess

Quantity Value Units Method Reference Comment
Δfgas>-161.83kcal/molTherLee, Smith, et al., 1979Computations put dHaff ca. 32 kcal/mol

References

Lee, Smith, et al., 1979
Lee, L.C.; Smith, G.P.; Moseley, J.T.; Cosby, P.C.; Guest, J.A., Photodissociation and photodetachment of Cl2-, ClO-, Cl3-, and BrCl2-, J. Chem. Phys., 1979, 70, 3237. [all data]