Dimethyl phthalate anion

Gas phase thermochemistry data

Data compiled by: John E. Bartmess

Quantity Value Units Method Reference Comment
Δfgas-165.28kcal/molR-EAKuhn, Levins, et al., 1968Done at constant temperature, accuracy uncertain: Chen and Wentworth, 1989;

References

Kuhn, Levins, et al., 1968
Kuhn, W.F.; Levins, R.J.; Lilly, A.C., Jr., Electron affinities and ionization potentials of phthalate compounds, J. Chem. Phys., 1968, 49, 5550. [all data]

Chen and Wentworth, 1989
Chen, E.C.M.; Wentworth, W.E., Experimental Determination of Electron Affinities of Organic Molecules, Mol. Cryst. Liq. Cryst., 1989, 171, 271. [all data]