NPF anion

Gas phase thermochemistry data

Data compiled by: John E. Bartmess

Quantity Value Units Method Reference Comment
Δfgas<-284.5kJ/molIMRBSullivan and Beauchamp, 1978NH2- + PF3 ->.

References

Sullivan and Beauchamp, 1978
Sullivan, S.A.; Beauchamp, J.L., Nucleophilic Reactions of Anions with PF3 and OPF3 in the Gas Phase by ICR Spectroscopy, Inorg. Chem., 1978, 17, 6, 1589, https://doi.org/10.1021/ic50184a039 . [all data]