Me2BCH2 anion

Reaction thermochemistry data

Data compiled by: John E. Bartmess

Individual Reactions

C3H8B- + Hydrogen cation = Borane, trimethyl-

By formula: C3H8B- + H+ = C3H9B

Quantity Value Units Method Reference Comment
Δr366.2 ± 6.1kcal/molG+TSMurphy and Beauchamp, 1976gas phase; Between AsH3,PH3; value altered from reference due to change in acidity scale
Quantity Value Units Method Reference Comment
Δr358.9 ± 6.0kcal/molIMRBMurphy and Beauchamp, 1976gas phase; Between AsH3,PH3; value altered from reference due to change in acidity scale

Gas phase ion energetics data

Data compiled by: John E. Bartmess

Electron affinity of neutral species

EAneutral (eV) Method Reference Comment
1.84 ± 0.34D-EAMurphy and Beauchamp, 1976Between AsH3,PH3; value altered from reference due to change in acidity scale

Protonation reactions

C3H8B- + Hydrogen cation = Borane, trimethyl-

By formula: C3H8B- + H+ = C3H9B

Quantity Value Units Method Reference Comment
Δr366.2 ± 6.1kcal/molG+TSMurphy and Beauchamp, 1976gas phase; Between AsH3,PH3; value altered from reference due to change in acidity scale
Quantity Value Units Method Reference Comment
Δr358.9 ± 6.0kcal/molIMRBMurphy and Beauchamp, 1976gas phase; Between AsH3,PH3; value altered from reference due to change in acidity scale

References

Murphy and Beauchamp, 1976
Murphy, M.K.; Beauchamp, J.L., Acid-base properties and gas-phase ion chemistry of (CH3)3B, J. Am. Chem. Soc., 1976, 98, 1433. [all data]