ThF4..F anion

Gas phase thermochemistry data

Data compiled by: John E. Bartmess

Quantity Value Units Method Reference Comment
Δfgas-579.9 ± 3.0kcal/molTDEqSidirov, Zhuravlena, et al., 1983Fluoride Affinity: 21.1 kcal < AlF3, 3.6 kcal < ZrF4; value altered from reference due to conversion from electron convention to ion convention

References

Sidirov, Zhuravlena, et al., 1983
Sidirov, L.N.; Zhuravlena, L.V.; Varkov, M.V.; Skokan, E.V.; Sorokin, I.D.; Koronev, Yu.M.; Akishima, P.A., Mass- spectrometric determination of enthalpies of dissociation of gaseous complex fluorides into neutral and charged particles. VII. MF-ThF4 systems, Int. J. Mass Spectrom. Ion Processes, 1983, 51, 291. [all data]