F2BO anion

Reaction thermochemistry data

Data compiled by: John E. Bartmess

Individual Reactions

BF2O- + Hydrogen cation = Difluorohydroxyborane

By formula: BF2O- + H+ = HBF2O

Quantity Value Units Method Reference Comment
Δr1579. ± 35.kJ/molAcidLarson and McMahon, 1987gas phase; These relative affinities are ca. 10 kcal/mol weaker than threshold values (see Wenthold and Squires, 1995) for donors greater than ca. 27 kcal/mol in free energy. This discrepancy has not yet been resolved, though the stronger value appears preferable.

References

Larson and McMahon, 1987
Larson, J.W.; McMahon, T.B., Trends in Gas Phase Fluoride Ion Affinities of the Main Group Oxyfluorides and Fluoride Sulfides. Fluoride Adducts of FAsO, FPO, FPO2, F2SiO, F4SO, FBO, F2SiS, FPS, FAsS, F2S2, and S2O., Inorg. Chem., 1987, 26, 24, 4018, https://doi.org/10.1021/ic00271a011 . [all data]

Wenthold and Squires, 1995
Wenthold, P.G.; Squires, R.R., Bond dissociation energies of F2(-) and HF2(-). A gas-phase experimental and G2 theoretical study, J. Phys. Chem., 1995, 99, 7, 2002, https://doi.org/10.1021/j100007a034 . [all data]